program: Orca
programVersion: 5.0.2
elementType: S S S P P O O O O O O C C C C C C C C C C C C C C C C H H H H H H H H H H H H H H H H H H H H
charge: 0
multiplicity: 1
keywords: wb97x-d3
keywords: def2-TZVPP
keywords: def2/J RIJCOSX
keywords: DEFGRID2
keywords: scfconv7
keywords: smallprint printgap noloewdin
keywords: NOSOSCF
formula: C16H20O6P2S3
InChI: InChI=1/C16H20O6P2S3/c1-17-23(25,18-2)21-13-5-9-15(10-6-13)27-16-11-7-14(8-12-16)22-24(26,19-3)20-4/h5-12H,1-4H3
47 atoms
S  0.016309 -2.765095 0.659901
S  -6.46812 -0.447181 1.590828
S  6.620666 -0.911251 -0.36976
P  -5.943607 0.796748 0.231834
P  5.917527 0.870549 -0.382514
O  -4.836749 0.280645 -0.827203
O  4.343319 1.014387 -0.726976
O  -5.294441 2.168005 0.714419
O  -7.066923 1.306703 -0.77532
O  5.983608 1.704842 0.972414
O  6.536365 1.897218 -1.430763
C  -1.412375 -1.811348 0.228061
C  1.326252 -1.649387 0.245501
C  -3.709544 -0.415024 -0.428075
C  3.380999 0.09523 -0.37367
C  -1.439514 -0.42341 0.326834
C  2.208649 -1.232159 1.232745
C  -2.551937 -2.493799 -0.188055
C  1.492183 -1.202315 -1.063123
C  -2.584844 0.278181 -0.01092
C  3.246181 -0.362326 0.926813
C  -3.708496 -1.796918 -0.503168
C  2.514127 -0.323922 -1.373054
C  -5.763202 2.833791 1.895215
C  -8.025762 0.389827 -1.320122
C  7.188218 1.73623 1.750316
C  6.930248 1.465137 -2.740464
H  -0.568172 0.124346 0.660018
H  2.084369 -1.568926 2.253338
H  -2.543412 -3.572564 -0.279297
H  0.820173 -1.532988 -1.844138
H  -2.592642 1.358603 0.046063
H  3.909873 -0.027043 1.712628
H  -4.591118 -2.327884 -0.834287
H  2.641374 0.033803 -2.386502
H  -5.155418 3.727162 2.005868
H  -5.639414 2.201734 2.773598
H  -6.809404 3.121139 1.797222
H  -8.678499 0.971364 -1.964776
H  -7.539145 -0.386891 -1.909783
H  -8.616505 -0.070691 -0.528979
H  6.968201 2.32393 2.636896
H  7.487012 0.731799 2.04913
H  8.000171 2.2088 1.198396
H  7.726869 0.724548 -2.681628
H  6.086653 1.049853 -3.291072
H  7.296023 2.347076 -3.258391
elementType: S P O C H
totalener: -2950.72145844 hartree
nucrepener: 3244.79726652 hartree
electener: -6195.51872496 hartree
twoeener: 4325.88380745 hartree
cpcmener: -0.03600594 hartree
kineticenergy: 2942.56532957 hartree
xcener: -192.749875467758 hartree
chargesum: -0.0000000
charge: -0.049077 -0.455045 -0.449105 0.778125 0.767314 -0.357917 -0.335301 -0.347514 -0.345399 -0.344781 -0.346882 0.048126 0.049986 0.232614 0.232701 -0.163918 -0.148088 -0.147470 -0.146485 -0.174747 -0.162960 -0.188927 -0.172111 -0.116577 -0.114061 -0.115581 -0.116000 0.155391 0.139183 0.137186 0.152427 0.156746 0.152106 0.152970 0.154760 0.130208 0.113789 0.128992 0.131168 0.127345 0.111528 0.131148 0.111333 0.130272 0.113750 0.127139 0.131635
qa: -0.0491 -0.4550 -0.4491 0.7781 0.7673 -0.3579 -0.3353 -0.3475 -0.3454 -0.3448 -0.3469 0.0481 0.0500 0.2326 0.2327 -0.1639 -0.1481 -0.1475 -0.1465 -0.1747 -0.1630 -0.1889 -0.1721 -0.1166 -0.1141 -0.1156 -0.1160 0.1554 0.1392 0.1372 0.1524 0.1567 0.1521 0.1530 0.1548 0.1302 0.1138 0.1290 0.1312 0.1273 0.1115 0.1311 0.1113 0.1303 0.1138 0.1271 0.1316
va: 2.3429 1.9829 1.9819 5.4794 5.4716 2.0966 2.1224 2.1026 2.0954 2.0918 2.0964 3.7668 3.7120 3.7150 3.7511 3.9188 4.0255 3.9548 3.9464 4.0432 3.9675 4.0340 3.9901 3.8400 3.8383 3.8353 3.8387 0.9898 1.0140 1.0105 0.9940 1.0060 1.0088 1.0001 0.9983 0.9912 0.9989 0.9861 0.9909 0.9857 0.9999 0.9904 1.0002 0.9887 0.9993 0.9852 0.9915
dispcorr: -0.023054598 hartree
energy: -2950.744513036423
dipole: 0.69684 -0.34338 0.35346 9.26840 -7.32108 1.94732 -1.82207 1.08033 -0.74173
magnitude: 2.11356 au
magnitude: 5.37225 debye
