program: Orca
programVersion: 5.0.2
elementType: S S S P P O O O O O O C C C C C C C C C C C C C C C C H H H H H H H H H H H H H H H H H H H H
charge: 0
multiplicity: 1
keywords: wb97x-d3
keywords: def2-TZVPP
keywords: def2/J RIJCOSX
keywords: DEFGRID2
keywords: scfconv7
keywords: smallprint printgap noloewdin
keywords: NOSOSCF
formula: C16H20O6P2S3
InChI: InChI=1/C16H20O6P2S3/c1-17-23(25,18-2)21-13-5-9-15(10-6-13)27-16-11-7-14(8-12-16)22-24(26,19-3)20-4/h5-12H,1-4H3
47 atoms
S  -0.007945 -3.287551 -0.504464
S  -6.454895 -0.649309 -0.537398
S  4.045354 2.299854 -0.937228
P  -5.672119 0.680768 0.590482
P  5.417252 1.168463 -0.225799
O  -4.075516 0.913867 0.387382
O  5.163373 -0.42435 -0.3313
O  -5.877513 0.393595 2.139256
O  -6.174345 2.183748 0.45319
O  6.86639 1.276237 -0.878742
O  5.757029 1.301406 1.324282
C  -1.21579 -2.02051 -0.223278
C  1.500017 -2.355053 -0.452685
C  -3.163901 -0.09853 0.196043
C  3.923478 -1.024358 -0.360501
C  -1.320485 -0.932103 -1.085539
C  1.803305 -1.528166 0.625821
C  -2.098689 -2.141395 0.842223
C  2.420781 -2.510135 -1.482194
C  -2.289705 0.031919 -0.874512
C  3.010884 -0.852417 0.671389
C  -3.081323 -1.183758 1.054096
C  3.637729 -1.845712 -1.436793
C  -5.304797 1.229116 3.16095
C  -6.348433 2.795797 -0.830915
C  7.019091 1.31054 -2.30366
C  5.878893 2.591562 1.938569
H  -0.646159 -0.834736 -1.926478
H  1.098688 -1.40781 1.438637
H  -2.020288 -2.978533 1.523213
H  2.189948 -3.141613 -2.329986
H  -2.372952 0.881022 -1.540303
H  3.245412 -0.221855 1.519445
H  -3.748817 -1.28417 1.900074
H  4.356185 -1.962896 -2.23774
H  -5.493716 0.729444 4.106986
H  -5.778811 2.209371 3.173022
H  -4.229089 1.342099 3.029387
H  -5.396925 2.88951 -1.353941
H  -7.047057 2.224732 -1.441852
H  -6.756594 3.78615 -0.649373
H  6.62929 0.402667 -2.764741
H  6.516606 2.178713 -2.72919
H  8.085272 1.380006 -2.500664
H  6.035139 2.415423 2.999201
H  6.730928 3.138853 1.535888
H  4.970411 3.176951 1.800081
elementType: S P O C H
totalener: -2950.72207712 hartree
nucrepener: 3281.23250018 hartree
electener: -6231.95457730 hartree
twoeener: 4362.02853241 hartree
cpcmener: -0.03932203 hartree
kineticenergy: 2942.53529080 hartree
xcener: -192.743310848482 hartree
chargesum: 0.0000000
charge: -0.073219 -0.432288 -0.450519 0.732837 0.770394 -0.336400 -0.341564 -0.348739 -0.339662 -0.345880 -0.345881 0.037794 0.037796 0.245699 0.225945 -0.111430 -0.137460 -0.155879 -0.147137 -0.201332 -0.166239 -0.157010 -0.175938 -0.117940 -0.110774 -0.115718 -0.115545 0.147663 0.151116 0.137393 0.136452 0.153511 0.152799 0.151648 0.154633 0.130337 0.130141 0.122762 0.127631 0.108555 0.130997 0.126191 0.110573 0.131574 0.130847 0.130029 0.111236
qa: -0.0732 -0.4323 -0.4505 0.7328 0.7704 -0.3364 -0.3416 -0.3487 -0.3397 -0.3459 -0.3459 0.0378 0.0378 0.2457 0.2259 -0.1114 -0.1375 -0.1559 -0.1471 -0.2013 -0.1662 -0.1570 -0.1759 -0.1179 -0.1108 -0.1157 -0.1155 0.1477 0.1511 0.1374 0.1365 0.1535 0.1528 0.1516 0.1546 0.1303 0.1301 0.1228 0.1276 0.1086 0.1310 0.1262 0.1106 0.1316 0.1308 0.1300 0.1112
va: 2.2808 2.0170 1.9820 5.4989 5.4727 2.0646 2.1112 2.0881 2.0883 2.0984 2.0924 3.7080 3.7300 3.7211 3.7263 3.9257 3.9493 4.0077 3.9786 4.0276 3.9705 3.9610 4.0157 3.8277 3.8388 3.8456 3.8356 0.9940 0.9929 1.0154 1.0141 0.9987 1.0077 1.0045 0.9964 0.9889 0.9946 0.9906 0.9863 1.0001 0.9896 0.9845 0.9995 0.9908 0.9901 0.9882 1.0004
dispcorr: -0.023649089 hartree
energy: -2950.745726206893
dipole: 6.29354 -4.47421 1.81933 12.20077 -9.97444 2.22633 3.32077 -2.44262 0.87815
magnitude: 3.00627 au
magnitude: 7.64133 debye
