program: Orca
programVersion: 5.0.2
elementType: S S S P P O O O O O O C C C C C C C C C C C C C C C C H H H H H H H H H H H H H H H H H H H H
charge: 0
multiplicity: 1
keywords: wb97x-d3
keywords: def2-TZVPP
keywords: def2/J RIJCOSX
keywords: DEFGRID2
keywords: scfconv7
keywords: smallprint printgap noloewdin
keywords: NOSOSCF
formula: C16H20O6P2S3
InChI: InChI=1/C16H20O6P2S3/c1-17-23(25,18-2)21-13-5-9-15(10-6-13)27-16-11-7-14(8-12-16)22-24(26,19-3)20-4/h5-12H,1-4H3
47 atoms
S  -0.14185 -3.090006 -0.071081
S  -5.474242 1.202587 -1.962127
S  6.079917 -0.038514 1.80358
P  -5.807474 0.938505 -0.093509
P  5.754259 0.815486 0.120213
O  -4.513092 0.786761 0.862472
O  4.815705 0.016073 -0.927086
O  -6.63615 -0.357674 0.317097
O  -6.583598 2.093742 0.678671
O  5.023307 2.23105 0.129134
O  7.01474 1.108981 -0.803932
C  -1.414315 -1.88613 0.182306
C  1.311576 -2.106883 -0.294469
C  -3.502763 -0.119784 0.596892
C  3.660424 -0.675532 -0.652585
C  -2.475258 -2.237883 1.011594
C  1.653865 -1.086957 0.587509
C  -1.413885 -0.643829 -0.446213
C  2.162952 -2.411826 -1.350431
C  -3.531837 -1.361466 1.207576
C  2.813092 -0.353107 0.400138
C  -2.451546 0.247073 -0.228212
C  3.346294 -1.710589 -1.519462
C  -7.761175 -0.788249 -0.460771
C  -6.273552 3.475522 0.45566
C  5.424708 3.257583 1.047091
C  8.081838 0.16012 -0.934523
H  -2.482173 -3.194843 1.517661
H  1.007696 -0.843069 1.420464
H  -0.603153 -0.357436 -1.102624
H  1.907602 -3.196938 -2.050126
H  -4.351221 -1.634138 1.859676
H  3.035585 0.456796 1.081102
H  -2.439712 1.221412 -0.697783
H  4.01121 -1.953507 -2.33803
H  -8.553513 -0.040016 -0.453535
H  -8.126165 -1.700165 0.003265
H  -7.467726 -0.997863 -1.488778
H  -6.413759 3.744136 -0.591014
H  -6.961945 4.049821 1.069433
H  -5.25082 3.702687 0.756445
H  5.287761 2.933437 2.078274
H  6.464083 3.543828 0.88852
H  4.78425 4.112836 0.850354
H  7.719523 -0.79529 -1.313428
H  8.782862 0.583159 -1.648609
H  8.585308 0.00778 0.019191
elementType: S P O C H
totalener: -2950.72053346 hartree
nucrepener: 3248.92485684 hartree
electener: -6199.64539031 hartree
twoeener: 4330.03034102 hartree
cpcmener: -0.03480418 hartree
kineticenergy: 2942.54413751 hartree
xcener: -192.749009491116 hartree
chargesum: -0.0000000
charge: -0.034573 -0.453956 -0.447828 0.774126 0.761992 -0.357409 -0.319743 -0.345676 -0.342513 -0.343752 -0.345532 0.045058 0.040373 0.250596 0.257398 -0.148997 -0.190334 -0.157819 -0.130265 -0.181731 -0.147601 -0.192206 -0.194472 -0.115278 -0.111979 -0.114708 -0.117626 0.136732 0.157990 0.159202 0.137730 0.154440 0.132471 0.149090 0.151466 0.127809 0.129598 0.112776 0.110364 0.131056 0.127784 0.112197 0.129429 0.131807 0.127075 0.131603 0.113838
qa: -0.0346 -0.4540 -0.4478 0.7741 0.7620 -0.3574 -0.3197 -0.3457 -0.3425 -0.3438 -0.3455 0.0451 0.0404 0.2506 0.2574 -0.1490 -0.1903 -0.1578 -0.1303 -0.1817 -0.1476 -0.1922 -0.1945 -0.1153 -0.1120 -0.1147 -0.1176 0.1367 0.1580 0.1592 0.1377 0.1544 0.1325 0.1491 0.1515 0.1278 0.1296 0.1128 0.1104 0.1311 0.1278 0.1122 0.1294 0.1318 0.1271 0.1316 0.1138
va: 2.3823 1.9871 1.9841 5.4898 5.4836 2.0988 2.1512 2.1089 2.0955 2.0826 2.1034 3.7745 3.7539 3.7033 3.7477 3.9664 4.0025 3.9223 3.9859 4.0653 3.9197 4.0215 4.0054 3.8423 3.8355 3.8351 3.8416 1.0111 0.9901 0.9872 1.0118 1.0034 1.0238 1.0089 1.0021 0.9859 0.9908 0.9995 1.0005 0.9906 0.9857 0.9991 0.9891 0.9901 0.9857 0.9912 0.9981
dispcorr: -0.022706026 hartree
energy: -2950.743239490598
dipole: -0.74610 0.82294 0.07684 7.71789 -6.44466 1.27324 0.12331 -0.07896 0.04435
magnitude: 1.27632 au
magnitude: 3.24416 debye
