program: Orca
programVersion: 5.0.2
elementType: S S S P P O O O O O O C C C C C C C C C C C C C C C C H H H H H H H H H H H H H H H H H H H H
charge: 0
multiplicity: 1
keywords: wb97x-d3
keywords: def2-TZVPP
keywords: def2/J RIJCOSX
keywords: DEFGRID2
keywords: scfconv7
keywords: smallprint printgap noloewdin
keywords: NOSOSCF
formula: C16H20O6P2S3
InChI: InChI=1/C16H20O6P2S3/c1-17-23(25,18-2)21-13-5-9-15(10-6-13)27-16-11-7-14(8-12-16)22-24(26,19-3)20-4/h5-12H,1-4H3
47 atoms
S  0.123555 -3.716331 0.139002
S  -4.987107 0.450447 2.699979
S  3.504132 2.289538 -0.195641
P  -5.013813 1.051205 0.881543
P  4.914391 1.247435 -0.965102
O  -4.448709 0.021069 -0.227257
O  4.909552 -0.335199 -0.628793
O  -4.177558 2.357106 0.518107
O  -6.432366 1.395241 0.247316
O  5.019729 1.19963 -2.552496
O  6.404999 1.622383 -0.554387
C  -1.208255 -2.551258 0.05396
C  1.52905 -2.667271 -0.100213
C  -3.365945 -0.814791 -0.069152
C  3.763942 -1.08331 -0.470923
C  -2.41098 -2.966322 -0.508354
C  1.692936 -1.956715 -1.285605
C  -1.102487 -1.26316 0.56849
C  2.49908 -2.588171 0.890372
C  -3.495534 -2.104812 -0.555069
C  2.805225 -1.155736 -1.472223
C  -2.172767 -0.386866 0.494931
C  3.622412 -1.795143 0.70618
C  -4.21511 3.512559 1.3666
C  -7.568201 0.552048 0.476914
C  4.913494 2.397439 -3.332747
C  6.736833 1.942959 0.802663
H  -2.509609 -3.96215 -0.920515
H  0.950575 -2.022508 -2.069809
H  -0.179952 -0.923351 1.020332
H  2.376214 -3.131083 1.817538
H  -4.429751 -2.428633 -0.994752
H  2.927608 -0.615027 -2.401093
H  -2.054769 0.621219 0.868964
H  4.376689 -1.725965 1.478622
H  -3.872098 3.270329 2.371353
H  -5.219285 3.931869 1.414931
H  -3.543902 4.242714 0.923879
H  -7.828581 0.52989 1.534215
H  -8.390156 0.981855 -0.088024
H  -7.385346 -0.463079 0.125408
H  3.95337 2.885421 -3.170246
H  5.720322 3.091217 -3.099008
H  4.991881 2.095781 -4.373164
H  7.808934 2.116409 0.825652
H  6.217898 2.84398 1.127183
H  6.493838 1.120422 1.475283
elementType: S P O C H
totalener: -2950.72156143 hartree
nucrepener: 3311.38924435 hartree
electener: -6262.11080578 hartree
twoeener: 4392.71357672 hartree
cpcmener: -0.03606164 hartree
kineticenergy: 2942.58195691 hartree
xcener: -192.754032881303 hartree
chargesum: 0.0000000
charge: -0.057623 -0.449665 -0.448956 0.763370 0.766691 -0.329680 -0.338322 -0.345852 -0.346058 -0.343824 -0.346181 0.042828 0.038719 0.223080 0.235977 -0.147394 -0.138666 -0.165345 -0.128672 -0.182728 -0.165470 -0.160370 -0.187773 -0.115588 -0.115421 -0.117032 -0.115147 0.136454 0.151109 0.151647 0.138529 0.152259 0.156785 0.145612 0.153433 0.112224 0.130800 0.131592 0.112230 0.131182 0.126263 0.112368 0.130473 0.131212 0.131411 0.112731 0.126791
qa: -0.0576 -0.4497 -0.4490 0.7634 0.7667 -0.3297 -0.3383 -0.3459 -0.3461 -0.3438 -0.3462 0.0428 0.0387 0.2231 0.2360 -0.1474 -0.1387 -0.1653 -0.1287 -0.1827 -0.1655 -0.1604 -0.1878 -0.1156 -0.1154 -0.1170 -0.1151 0.1365 0.1511 0.1516 0.1385 0.1523 0.1568 0.1456 0.1534 0.1122 0.1308 0.1316 0.1122 0.1312 0.1263 0.1124 0.1305 0.1312 0.1314 0.1127 0.1268
va: 2.3259 1.9835 1.9840 5.4807 5.4760 2.1274 2.1154 2.0865 2.0996 2.0956 2.0981 3.7654 3.7062 3.7487 3.7255 3.9692 3.9703 3.9502 3.9744 4.0113 3.9612 3.9503 4.0260 3.8328 3.8421 3.8356 3.8410 1.0111 0.9963 0.9931 1.0127 0.9999 1.0070 1.0138 0.9980 1.0002 0.9890 0.9904 0.9991 0.9910 0.9856 0.9994 0.9881 0.9906 0.9911 0.9993 0.9849
dispcorr: -0.023266238 hartree
energy: -2950.744827666793
dipole: 0.58201 -0.02261 0.55940 9.85331 -8.59779 1.25552 -2.03644 1.19314 -0.84330
magnitude: 1.61258 au
magnitude: 4.09886 debye
