program: Orca
programVersion: 5.0.2
elementType: S S S P P O O O O O O C C C C C C C C C C C C C C C C H H H H H H H H H H H H H H H H H H H H
charge: 0
multiplicity: 1
keywords: wb97x-d3
keywords: def2-TZVPP
keywords: def2/J RIJCOSX
keywords: DEFGRID2
keywords: scfconv7
keywords: smallprint printgap noloewdin
keywords: NOSOSCF
formula: C16H20O6P2S3
InChI: InChI=1/C16H20O6P2S3/c1-17-23(25,18-2)21-13-5-9-15(10-6-13)27-16-11-7-14(8-12-16)22-24(26,19-3)20-4/h5-12H,1-4H3
47 atoms
S  -0.015675 -3.454553 -0.323955
S  -4.910711 1.485677 -1.5472
S  4.165884 1.757238 1.18749
P  -5.447655 0.989159 0.222837
P  5.324059 1.051502 -0.164879
O  -4.313419 0.323993 1.160449
O  5.098564 -0.505382 -0.543599
O  -6.61288 -0.086621 0.369918
O  -5.966472 2.147029 1.183634
O  5.26318 1.707938 -1.614057
O  6.889281 1.065074 0.125866
C  -1.254286 -2.253416 0.067257
C  1.472192 -2.498616 -0.354718
C  -3.319814 -0.531611 0.739209
C  3.87193 -1.131374 -0.474711
C  -1.023425 -1.189698 0.935068
C  2.544909 -2.902476 0.430288
C  -2.526383 -2.440727 -0.462507
C  1.609406 -1.401254 -1.201231
C  -2.050308 -0.318476 1.255158
C  3.751871 -2.22063 0.368407
C  -3.56725 -1.591028 -0.118142
C  2.80513 -0.706995 -1.255585
C  -7.823931 0.052812 -0.3868
C  -5.328572 3.43075 1.205195
C  5.301751 3.133511 -1.771825
C  7.400977 0.717845 1.419102
H  -0.043135 -1.028968 1.364229
H  2.444564 -3.7459 1.100506
H  -2.720482 -3.255147 -1.148586
H  0.783634 -1.083031 -1.824121
H  -1.86933 0.512506 1.92455
H  4.589285 -2.533312 0.97832
H  -4.554783 -1.775079 -0.519691
H  2.907331 0.137516 -1.924525
H  -8.36936 0.948558 -0.090496
H  -8.42834 -0.823124 -0.169509
H  -7.61472 0.090492 -1.455701
H  -5.864982 4.030083 1.935444
H  -4.284586 3.348011 1.507371
H  -5.387933 3.912049 0.229618
H  6.251685 3.54055 -1.426626
H  5.192531 3.330274 -2.834523
H  4.483127 3.608315 -1.231494
H  7.147881 -0.309798 1.680013
H  8.481249 0.81627 1.36052
H  7.018393 1.392682 2.184083
elementType: S P O C H
totalener: -2950.72175882 hartree
nucrepener: 3284.12457088 hartree
electener: -6234.84632970 hartree
twoeener: 4365.42972802 hartree
cpcmener: -0.03582125 hartree
kineticenergy: 2942.55983297 hartree
xcener: -192.749860573560 hartree
chargesum: 0.0000000
charge: -0.044784 -0.449318 -0.450638 0.763795 0.770223 -0.330235 -0.343664 -0.344934 -0.346600 -0.344076 -0.345666 0.041000 0.040176 0.230809 0.224964 -0.143425 -0.132996 -0.162969 -0.149946 -0.192462 -0.182505 -0.162228 -0.158244 -0.115048 -0.115663 -0.114916 -0.115208 0.152501 0.137744 0.136845 0.154979 0.152652 0.155451 0.144982 0.156793 0.129677 0.131078 0.110927 0.131129 0.127027 0.111827 0.128961 0.131079 0.110738 0.127027 0.131552 0.111589
qa: -0.0448 -0.4493 -0.4506 0.7638 0.7702 -0.3302 -0.3437 -0.3449 -0.3466 -0.3441 -0.3457 0.0410 0.0402 0.2308 0.2250 -0.1434 -0.1330 -0.1630 -0.1499 -0.1925 -0.1825 -0.1622 -0.1582 -0.1150 -0.1157 -0.1149 -0.1152 0.1525 0.1377 0.1368 0.1550 0.1527 0.1555 0.1450 0.1568 0.1297 0.1311 0.1109 0.1311 0.1270 0.1118 0.1290 0.1311 0.1107 0.1270 0.1316 0.1116
va: 2.3583 1.9845 1.9824 5.4801 5.4726 2.1281 2.1104 2.0891 2.0982 2.0980 2.0986 3.7723 3.7199 3.7438 3.7282 3.9111 3.9783 3.9942 3.9696 4.0005 4.0287 3.9675 3.9626 3.8343 3.8413 3.8368 3.8415 0.9912 1.0132 1.0134 0.9927 1.0009 0.9962 1.0137 1.0063 0.9894 0.9900 1.0005 0.9912 0.9851 0.9997 0.9884 0.9901 0.9998 0.9846 0.9910 1.0000
dispcorr: -0.023093797 hartree
energy: -2950.744852618414
dipole: 0.28699 0.15709 0.44408 8.68825 -7.68070 1.00755 1.61883 -1.18880 0.43003
magnitude: 1.18207 au
magnitude: 3.00459 debye
