program: Orca
programVersion: 5.0.2
elementType: S S S P P O O O O O O C C C C C C C C C C C C C C C C H H H H H H H H H H H H H H H H H H H H
charge: 0
multiplicity: 1
keywords: wb97x-d3
keywords: def2-TZVPP
keywords: def2/J RIJCOSX
keywords: DEFGRID2
keywords: scfconv7
keywords: smallprint printgap noloewdin
keywords: NOSOSCF
formula: C16H20O6P2S3
InChI: InChI=1/C16H20O6P2S3/c1-17-23(25,18-2)21-13-5-9-15(10-6-13)27-16-11-7-14(8-12-16)22-24(26,19-3)20-4/h5-12H,1-4H3
47 atoms
S  0.047335 -2.460259 1.388342
S  -5.445428 2.255749 1.344486
S  6.809156 -1.067908 -0.342539
P  -6.006734 0.807015 0.220866
P  6.011567 0.618463 -0.772854
O  -4.866769 0.108408 -0.685308
O  4.433007 0.605226 -1.117637
O  -7.085921 1.134695 -0.902736
O  -6.642621 -0.465369 0.933336
O  6.059749 1.763014 0.331795
O  6.560583 1.383566 -2.056019
C  -1.392729 -1.643769 0.757865
C  1.364312 -1.54638 0.638546
C  -3.724099 -0.460632 -0.152772
C  3.465586 -0.143256 -0.491698
C  -2.529104 -2.41518 0.532805
C  1.476925 -1.453415 -0.746649
C  -1.437597 -0.271108 0.529849
C  2.322747 -0.949779 1.447092
C  -3.70255 -1.823117 0.091155
C  2.522504 -0.74764 -1.312378
C  -2.600427 0.321194 0.063774
C  3.384596 -0.252511 0.886665
C  -7.0795 2.379711 -1.613054
C  -7.555712 -0.32271 2.029437
C  7.263861 2.035035 1.062266
C  6.856673 0.67691 -3.267459
H  -2.505406 -3.485984 0.689807
H  0.745808 -1.926072 -1.38943
H  -0.566746 0.346516 0.705589
H  2.242077 -1.01029 2.524331
H  -4.579682 -2.42902 -0.094037
H  2.608792 -0.66488 -2.388032
H  -2.627738 1.384691 -0.132323
H  4.106142 0.225306 1.535716
H  -6.184606 2.476751 -2.227371
H  -7.143401 3.223056 -0.926272
H  -7.955752 2.372722 -2.255487
H  -7.812217 -1.328724 2.349628
H  -7.09141 0.212319 2.85697
H  -8.46192 0.197627 1.720152
H  7.611454 1.145946 1.587637
H  8.049533 2.399483 0.400858
H  7.017846 2.807209 1.78569
H  7.608312 -0.093429 -3.097175
H  5.958744 0.22416 -3.687773
H  7.247153 1.411515 -3.966337
elementType: S P O C H
totalener: -2950.72122790 hartree
nucrepener: 3230.33576268 hartree
electener: -6181.05699057 hartree
twoeener: 4311.46550521 hartree
cpcmener: -0.03502672 hartree
kineticenergy: 2942.55068199 hartree
xcener: -192.748276023556 hartree
chargesum: -0.0000000
charge: -0.049792 -0.455725 -0.448365 0.773518 0.762254 -0.356329 -0.326734 -0.343556 -0.342652 -0.344199 -0.345900 0.034323 0.034142 0.262170 0.238656 -0.145356 -0.133354 -0.144272 -0.147290 -0.190750 -0.182509 -0.201073 -0.164903 -0.111899 -0.115084 -0.115461 -0.115117 0.137350 0.153723 0.156415 0.137952 0.153446 0.154366 0.148337 0.149636 0.128236 0.111060 0.130737 0.129188 0.112575 0.127972 0.112472 0.130960 0.131392 0.111261 0.127428 0.130749
qa: -0.0498 -0.4557 -0.4484 0.7735 0.7623 -0.3563 -0.3267 -0.3436 -0.3427 -0.3442 -0.3459 0.0343 0.0341 0.2622 0.2387 -0.1454 -0.1334 -0.1443 -0.1473 -0.1908 -0.1825 -0.2011 -0.1649 -0.1119 -0.1151 -0.1155 -0.1151 0.1374 0.1537 0.1564 0.1380 0.1534 0.1544 0.1483 0.1496 0.1282 0.1111 0.1307 0.1292 0.1126 0.1280 0.1125 0.1310 0.1314 0.1113 0.1274 0.1307
va: 2.3423 1.9857 1.9865 5.4883 5.4839 2.1041 2.1315 2.0924 2.1080 2.0907 2.0998 3.7736 3.7219 3.6886 3.7532 3.9589 3.9366 3.9072 4.0274 4.0638 3.9865 4.0312 3.9729 3.8327 3.8429 3.8315 3.8400 1.0112 0.9925 0.9884 1.0150 1.0037 0.9994 1.0099 1.0112 0.9853 1.0008 0.9908 0.9907 0.9994 0.9859 1.0001 0.9889 0.9901 0.9998 0.9852 0.9908
dispcorr: -0.022748412 hartree
energy: -2950.743976309664
dipole: -1.78784 1.45836 -0.32949 5.71400 -4.82028 0.89372 -3.57067 2.52637 -1.04430
magnitude: 1.41345 au
magnitude: 3.59271 debye
