program: Orca
programVersion: 5.0.2
elementType: S S S P P O O O O O O C C C C C C C C C C C C C C C C H H H H H H H H H H H H H H H H H H H H
charge: 0
multiplicity: 1
keywords: wb97x-d3
keywords: def2-TZVPP
keywords: def2/J RIJCOSX
keywords: DEFGRID2
keywords: scfconv7
keywords: smallprint printgap noloewdin
keywords: NOSOSCF
formula: C16H20O6P2S3
InChI: InChI=1/C16H20O6P2S3/c1-17-23(25,18-2)21-13-5-9-15(10-6-13)27-16-11-7-14(8-12-16)22-24(26,19-3)20-4/h5-12H,1-4H3
47 atoms
S  -0.100924 -3.464765 -0.29524
S  -3.730784 2.333862 0.580502
S  4.597948 1.010589 -2.675155
P  -5.161038 1.154854 1.061572
P  5.375987 0.76877 -0.940662
O  -5.059856 -0.352633 0.484306
O  4.359981 0.386237 0.255163
O  -6.630254 1.54717 0.594942
O  -5.389316 0.849546 2.60596
O  6.464689 -0.381625 -0.779327
O  6.119207 2.01676 -0.288112
C  -1.55759 -2.494081 -0.049438
C  1.190074 -2.264001 -0.13949
C  -3.8745 -1.037322 0.33283
C  3.317086 -0.505765 0.081557
C  -1.858539 -1.977318 1.207565
C  0.997057 -0.902925 -0.355972
C  -2.431263 -2.285161 -1.108671
C  2.460847 -2.735051 0.180485
C  -3.013153 -1.240106 1.402953
C  2.06081 -0.021925 -0.240186
C  -3.594579 -1.553846 -0.919611
C  3.529782 -1.858967 0.281399
C  -6.880332 2.108045 -0.700857
C  -5.422693 1.910932 3.569785
C  7.473904 -0.585728 -1.779142
C  5.553336 3.331923 -0.372765
H  -1.190543 -2.14514 2.042029
H  0.021185 -0.513978 -0.614498
H  -2.205412 -2.6813 -2.089525
H  2.626342 -3.789536 0.361947
H  -3.239604 -0.853925 2.387866
H  1.906525 1.037504 -0.397023
H  -4.275524 -1.3862 -1.743499
H  4.511816 -2.231675 0.541129
H  -6.523956 1.450514 -1.49353
H  -6.410496 3.085785 -0.796967
H  -7.958131 2.215576 -0.78451
H  -4.486501 2.467974 3.568686
H  -6.252903 2.589559 3.376714
H  -5.561273 1.442365 4.539965
H  7.024176 -0.806495 -2.746432
H  8.120954 0.286319 -1.868024
H  8.062872 -1.437752 -1.452386
H  5.45978 3.649868 -1.410555
H  4.577009 3.37375 0.110127
H  6.237523 3.996566 0.147173
elementType: S P O C H
totalener: -2950.72219285 hartree
nucrepener: 3292.97616626 hartree
electener: -6243.69835912 hartree
twoeener: 4374.42241887 hartree
cpcmener: -0.03585012 hartree
kineticenergy: 2942.57676035 hartree
xcener: -192.751588163425 hartree
chargesum: -0.0000000
charge: -0.052878 -0.448419 -0.456072 0.764904 0.777527 -0.337070 -0.359616 -0.345829 -0.343340 -0.346943 -0.344646 0.046409 0.064624 0.236649 0.227928 -0.147202 -0.156723 -0.121406 -0.164731 -0.158189 -0.194813 -0.188053 -0.166502 -0.115688 -0.115367 -0.117122 -0.113839 0.150393 0.147654 0.139694 0.135025 0.156788 0.150913 0.153684 0.155361 0.127166 0.114142 0.131382 0.111652 0.129906 0.131115 0.112895 0.127800 0.130433 0.111180 0.127430 0.131793
qa: -0.0529 -0.4484 -0.4561 0.7649 0.7775 -0.3371 -0.3596 -0.3458 -0.3433 -0.3469 -0.3446 0.0464 0.0646 0.2366 0.2279 -0.1472 -0.1567 -0.1214 -0.1647 -0.1582 -0.1948 -0.1881 -0.1665 -0.1157 -0.1154 -0.1171 -0.1138 0.1504 0.1477 0.1397 0.1350 0.1568 0.1509 0.1537 0.1554 0.1272 0.1141 0.1314 0.1117 0.1299 0.1311 0.1129 0.1278 0.1304 0.1112 0.1274 0.1318
va: 2.3474 1.9842 1.9813 5.4782 5.4830 2.1168 2.0946 2.0973 2.0969 2.1079 2.0940 3.7147 3.7906 3.7310 3.7102 3.9887 3.8979 3.9715 3.9652 3.9554 4.0277 4.0212 4.0535 3.8398 3.8352 3.8426 3.8388 0.9985 0.9968 1.0111 1.0101 1.0071 1.0022 0.9985 1.0038 0.9848 0.9988 0.9915 0.9997 0.9887 0.9903 0.9993 0.9863 0.9904 1.0002 0.9852 0.9909
dispcorr: -0.023276379 hartree
energy: -2950.745469229674
dipole: 0.02244 -0.65459 -0.63215 8.03322 -7.14677 0.88645 1.88859 -1.13326 0.75534
magnitude: 1.32512 au
magnitude: 3.36819 debye
