program: Orca
programVersion: 5.0.2
elementType: S S S P P O O O O O O C C C C C C C C C C C C C C C C H H H H H H H H H H H H H H H H H H H H
charge: 0
multiplicity: 1
keywords: wb97x-d3
keywords: def2-TZVPP
keywords: def2/J RIJCOSX
keywords: DEFGRID2
keywords: scfconv7
keywords: smallprint printgap noloewdin
keywords: NOSOSCF
formula: C16H20O6P2S3
InChI: InChI=1/C16H20O6P2S3/c1-17-23(25,18-2)21-13-5-9-15(10-6-13)27-16-11-7-14(8-12-16)22-24(26,19-3)20-4/h5-12H,1-4H3
47 atoms
S  0.111542 -3.447902 0.340393
S  -4.06773 1.662219 -1.194108
S  4.653594 1.714272 1.682293
P  -5.259019 0.975096 0.138342
P  5.335966 1.204856 -0.028717
O  -5.050242 -0.580212 0.534825
O  4.256389 0.540885 -1.046019
O  -6.816604 0.994783 -0.190077
O  -5.22733 1.643229 1.5831
O  5.927914 2.338952 -0.975295
O  6.541649 0.176153 0.065953
C  -1.402058 -2.533977 0.383874
C  1.308016 -2.201294 -0.041391
C  -3.819785 -1.201503 0.486138
C  3.301675 -0.377381 -0.669359
C  -2.445451 -2.919677 -0.447796
C  2.605994 -2.390624 0.422175
C  -1.580278 -1.478725 1.275325
C  1.018131 -1.090616 -0.828969
C  -3.662159 -2.254546 -0.395597
C  3.609372 -1.49008 0.098568
C  -2.785673 -0.801073 1.321271
C  2.00911 -0.170135 -1.125898
C  -7.293891 0.662219 -1.500503
C  -5.244677 3.071442 1.723871
C  5.191265 3.541172 -1.234323
C  7.181152 -0.382816 -1.095122
H  -2.312339 -3.73136 -1.150542
H  2.849422 -3.243707 1.043028
H  -0.77737 -1.177494 1.935435
H  0.018605 -0.927261 -1.210011
H  -4.47619 -2.549052 -1.044878
H  4.615547 -1.673364 0.452438
H  -2.920115 0.015081 2.019119
H  1.779276 0.699256 -1.728463
H  -6.906797 1.358207 -2.244117
H  -8.376756 0.740727 -1.463652
H  -7.01698 -0.355664 -1.775408
H  -4.388529 3.522826 1.222606
H  -6.166307 3.495092 1.325013
H  -5.187477 3.277811 2.789061
H  4.253528 3.326558 -1.746489
H  4.986537 4.077828 -0.308353
H  5.816237 4.155839 -1.87586
H  6.454724 -0.763526 -1.812669
H  7.82044 0.356873 -1.576043
H  7.792414 -1.208702 -0.741876
elementType: S P O C H
totalener: -2950.72223430 hartree
nucrepener: 3303.79795484 hartree
electener: -6254.52018914 hartree
twoeener: 4384.85384176 hartree
cpcmener: -0.03831527 hartree
kineticenergy: 2942.54741028 hartree
xcener: -192.746914396753 hartree
chargesum: -0.0000000
charge: -0.044583 -0.450651 -0.434069 0.771781 0.732321 -0.346507 -0.336719 -0.345956 -0.344408 -0.339792 -0.348367 0.045447 0.045594 0.226669 0.235535 -0.130473 -0.160505 -0.154187 -0.145899 -0.184256 -0.161476 -0.155702 -0.200500 -0.115391 -0.116016 -0.109996 -0.117244 0.138146 0.136548 0.154274 0.149926 0.155940 0.149409 0.157867 0.152762 0.112212 0.131647 0.126926 0.111652 0.128755 0.131390 0.126727 0.108504 0.130267 0.123509 0.129465 0.129421
qa: -0.0446 -0.4507 -0.4341 0.7718 0.7323 -0.3465 -0.3367 -0.3460 -0.3444 -0.3398 -0.3484 0.0454 0.0456 0.2267 0.2355 -0.1305 -0.1605 -0.1542 -0.1459 -0.1843 -0.1615 -0.1557 -0.2005 -0.1154 -0.1160 -0.1100 -0.1172 0.1381 0.1365 0.1543 0.1499 0.1559 0.1494 0.1579 0.1528 0.1122 0.1316 0.1269 0.1117 0.1288 0.1314 0.1267 0.1085 0.1303 0.1235 0.1295 0.1294
va: 2.3593 1.9820 2.0163 5.4708 5.5026 2.1079 2.0656 2.0974 2.0984 2.0877 2.0871 3.7146 3.7748 3.7231 3.7270 3.9807 3.9772 3.9702 3.9086 4.0307 3.9593 3.9651 4.0250 3.8414 3.8375 3.8399 3.8285 1.0130 1.0125 0.9936 0.9931 0.9957 1.0083 1.0055 0.9999 0.9998 0.9913 0.9845 0.9993 0.9881 0.9904 0.9870 0.9998 0.9898 0.9916 0.9939 0.9890
dispcorr: -0.023828779 hartree
energy: -2950.746063080167
dipole: -1.83322 1.06512 -0.76810 6.50183 -6.03029 0.47154 -7.59942 5.73342 -1.86600
magnitude: 2.07227 au
magnitude: 5.26728 debye
