program: Orca
programVersion: 5.0.2
elementType: S S S P P O O O O O O C C C C C C C C C C C C C C C C H H H H H H H H H H H H H H H H H H H H
charge: 0
multiplicity: 1
keywords: wb97x-d3
keywords: def2-TZVPP
keywords: def2/J RIJCOSX
keywords: DEFGRID2
keywords: scfconv7
keywords: smallprint printgap noloewdin
keywords: NOSOSCF
formula: C16H20O6P2S3
InChI: InChI=1/C16H20O6P2S3/c1-17-23(25,18-2)21-13-5-9-15(10-6-13)27-16-11-7-14(8-12-16)22-24(26,19-3)20-4/h5-12H,1-4H3
47 atoms
S  -0.031764 -3.267102 -0.679489
S  -5.01331 1.595687 -1.408823
S  4.251012 1.717141 1.478927
P  -5.5172 1.004854 0.341711
P  5.382436 1.107327 0.063194
O  -4.363933 0.28512 1.214602
O  5.142946 -0.435369 -0.395656
O  -6.677008 -0.081063 0.452532
O  -6.019911 2.108386 1.373214
O  5.262918 1.982762 -1.255673
O  6.954527 1.075601 0.306504
C  -1.275488 -2.12679 -0.148674
C  1.467474 -2.339001 -0.544642
C  -3.3610 -0.512971 0.709387
C  3.901457 -1.027928 -0.435916
C  -1.051981 -1.150441 0.817679
C  1.662732 -1.167015 -1.270861
C  -2.551814 -2.283395 -0.679991
C  2.499675 -2.846142 0.235333
C  -2.089376 -0.331187 1.23122
C  2.874832 -0.501812 -1.209929
C  -3.601215 -1.489425 -0.243887
C  3.722124 -2.192422 0.289159
C  -7.890877 0.079919 -0.29492
C  -5.391512 3.395237 1.442766
C  5.976686 1.672352 -2.465171
C  7.50825 0.448697 1.470437
H  -0.06958 -1.014733 1.250711
H  0.870296 -0.768747 -1.891013
H  -2.742072 -3.030039 -1.44046
H  2.354597 -3.751032 0.810398
H  -1.912766 0.433943 1.976107
H  3.019863 0.400821 -1.789465
H  -4.590232 -1.649956 -0.651992
H  4.527898 -2.586625 0.89448
H  -8.490179 -0.806472 -0.107879
H  -7.684856 0.157115 -1.36233
H  -8.440348 0.961495 0.034703
H  -4.350208 3.308636 1.75277
H  -5.443862 3.907543 0.48254
H  -5.939555 3.967658 2.185823
H  7.038332 1.886613 -2.353219
H  5.840081 0.631698 -2.757194
H  5.561848 2.312745 -3.238415
H  7.103289 0.891543 2.380179
H  7.314144 -0.623693 1.468958
H  8.580508 0.618876 1.434572
elementType: S P O C H
totalener: -2950.72182674 hartree
nucrepener: 3280.15727433 hartree
electener: -6230.87910107 hartree
twoeener: 4361.30495256 hartree
cpcmener: -0.03839011 hartree
kineticenergy: 2942.54376034 hartree
xcener: -192.747117354982 hartree
chargesum: 0.0000000
charge: -0.045248 -0.450149 -0.432182 0.766686 0.733324 -0.332316 -0.343023 -0.345650 -0.346340 -0.348679 -0.339867 0.047602 0.034698 0.226721 0.243996 -0.151932 -0.148845 -0.165795 -0.122986 -0.188915 -0.154941 -0.159845 -0.196210 -0.115757 -0.116344 -0.118286 -0.108680 0.152332 0.155497 0.135725 0.138247 0.153037 0.154590 0.143865 0.154086 0.131056 0.111313 0.129970 0.127402 0.112003 0.130990 0.129658 0.123380 0.130200 0.107204 0.127167 0.131242
qa: -0.0452 -0.4501 -0.4322 0.7667 0.7333 -0.3323 -0.3430 -0.3457 -0.3463 -0.3487 -0.3399 0.0476 0.0347 0.2267 0.2440 -0.1519 -0.1488 -0.1658 -0.1230 -0.1889 -0.1549 -0.1598 -0.1962 -0.1158 -0.1163 -0.1183 -0.1087 0.1523 0.1555 0.1357 0.1382 0.1530 0.1546 0.1439 0.1541 0.1311 0.1113 0.1300 0.1274 0.1120 0.1310 0.1297 0.1234 0.1302 0.1072 0.1272 0.1312
va: 2.3610 1.9830 2.0159 5.4773 5.5001 2.1272 2.0581 2.0873 2.1000 2.0913 2.0889 3.7831 3.7236 3.7471 3.7093 3.9167 3.9700 3.9891 3.9779 4.0009 3.9487 3.9606 4.0461 3.8346 3.8408 3.8285 3.8391 0.9919 0.9935 1.0134 1.0128 1.0007 1.0022 1.0139 0.9976 0.9901 1.0004 0.9892 0.9852 0.9999 0.9911 0.9945 0.9912 0.9891 1.0003 0.9872 0.9895
dispcorr: -0.023523993 hartree
energy: -2950.745350735443
dipole: 2.29899 -1.30550 0.99349 3.01511 -3.27826 -0.26315 -1.40181 1.00766 -0.39415
magnitude: 1.10073 au
magnitude: 2.79785 debye
