program: Orca
programVersion: 5.0.2
elementType: S S S P P O O O O O O C C C C C C C C C C C C C C C C H H H H H H H H H H H H H H H H H H H H
charge: 0
multiplicity: 1
keywords: wb97x-d3
keywords: def2-TZVPP
keywords: def2/J RIJCOSX
keywords: DEFGRID2
keywords: scfconv7
keywords: smallprint printgap noloewdin
keywords: NOSOSCF
formula: C16H20O6P2S3
InChI: InChI=1/C16H20O6P2S3/c1-17-23(25,18-2)21-13-5-9-15(10-6-13)27-16-11-7-14(8-12-16)22-24(26,19-3)20-4/h5-12H,1-4H3
47 atoms
S  0.209115 -3.816676 0.350402
S  -4.252511 1.675304 2.761676
S  3.0480 2.288748 -1.280003
P  -4.7395 1.230798 0.961445
P  4.656675 1.268932 -1.075144
O  -4.55868 -0.311436 0.513508
O  4.575091 -0.28807 -1.51141
O  -3.968999 1.966635 -0.219293
O  -6.263248 1.448694 0.560622
O  5.927809 1.728406 -1.914464
O  5.259321 1.131509 0.390963
C  -1.172037 -2.708201 0.391531
C  1.498605 -2.739521 -0.209196
C  -3.402158 -1.055169 0.511232
C  3.544583 -1.096087 -1.067166
C  -2.425028 -3.19282 0.030823
C  1.386979 -2.061459 -1.420776
C  -1.051266 -1.392234 0.822465
C  2.650518 -2.605655 0.555217
C  -3.539476 -2.373694 0.103123
C  2.403041 -1.224079 -1.845123
C  -2.156208 -0.556905 0.869344
C  3.683576 -1.784703 0.124565
C  -3.515711 3.321736 -0.098323
C  -7.327374 1.075569 1.446829
C  5.796611 2.190384 -3.265429
C  5.184348 2.205785 1.337439
H  -2.541391 -4.21145 -0.316262
H  0.501069 -2.175298 -2.031678
H  -0.089505 -0.995905 1.120736
H  2.743889 -3.127868 1.498083
H  -4.511708 -2.754489 -0.181528
H  2.316302 -0.686937 -2.780011
H  -2.017199 0.463437 1.199122
H  4.581756 -1.682735 0.718874
H  -2.937587 3.5330 -0.993336
H  -2.881778 3.446481 0.778494
H  -4.357061 4.010972 -0.041318
H  -7.36017 -0.004712 1.584515
H  -7.220266 1.563845 2.414927
H  -8.249896 1.405512 0.97788
H  5.45148 1.391366 -3.92112
H  5.109484 3.033865 -3.325748
H  6.786008 2.510187 -3.579712
H  5.730558 3.080351 0.9859
H  4.148661 2.478046 1.536348
H  5.642937 1.841095 2.252122
elementType: S P O C H
totalener: -2950.71943873 hartree
nucrepener: 3340.22258928 hartree
electener: -6290.94202800 hartree
twoeener: 4421.40336645 hartree
cpcmener: -0.03384811 hartree
kineticenergy: 2942.56333051 hartree
xcener: -192.752091612384 hartree
chargesum: -0.0000000
charge: -0.055578 -0.451399 -0.453162 0.763398 0.778885 -0.313870 -0.358863 -0.341898 -0.346757 -0.343343 -0.346470 0.021176 0.033677 0.287600 0.269234 -0.133339 -0.121894 -0.175173 -0.135418 -0.208877 -0.201799 -0.170702 -0.186163 -0.110777 -0.116656 -0.112729 -0.116090 0.136302 0.151896 0.152980 0.137146 0.150343 0.150898 0.123618 0.155201 0.131282 0.111858 0.131970 0.128085 0.110035 0.131245 0.128377 0.110977 0.131126 0.129873 0.113943 0.129834
qa: -0.0556 -0.4514 -0.4532 0.7634 0.7789 -0.3139 -0.3589 -0.3419 -0.3468 -0.3433 -0.3465 0.0212 0.0337 0.2876 0.2692 -0.1333 -0.1219 -0.1752 -0.1354 -0.2089 -0.2018 -0.1707 -0.1862 -0.1108 -0.1167 -0.1127 -0.1161 0.1363 0.1519 0.1530 0.1371 0.1503 0.1509 0.1236 0.1552 0.1313 0.1119 0.1320 0.1281 0.1100 0.1312 0.1284 0.1110 0.1311 0.1299 0.1139 0.1298
va: 2.3313 1.9805 1.9851 5.4904 5.4797 2.1771 2.0969 2.0799 2.1094 2.0992 2.1057 3.7743 3.7161 3.7145 3.6916 3.9671 3.9170 3.9953 3.9873 4.0151 4.0141 3.9369 4.0590 3.8282 3.8423 3.8344 3.8401 1.0111 0.9935 0.9919 1.0136 1.0038 1.0051 1.0314 1.0046 0.9906 0.9996 0.9881 0.9861 0.9999 0.9897 0.9856 1.0005 0.9906 0.9859 0.9989 0.9912
dispcorr: -0.023164086 hartree
energy: -2950.742602813461
dipole: 0.88722 -0.49519 0.39203 9.49643 -8.45811 1.03833 -1.87126 1.14440 -0.72685
magnitude: 1.32670 au
magnitude: 3.37220 debye
