program: Orca
programVersion: 5.0.2
elementType: S S S P P O O O O O O C C C C C C C C C C C C C C C C H H H H H H H H H H H H H H H H H H H H
charge: 0
multiplicity: 1
keywords: wb97x-d3
keywords: def2-TZVPP
keywords: def2/J RIJCOSX
keywords: DEFGRID2
keywords: scfconv7
keywords: smallprint printgap noloewdin
keywords: NOSOSCF
formula: C16H20O6P2S3
InChI: InChI=1/C16H20O6P2S3/c1-17-23(25,18-2)21-13-5-9-15(10-6-13)27-16-11-7-14(8-12-16)22-24(26,19-3)20-4/h5-12H,1-4H3
47 atoms
S  -0.047733 -4.191529 -0.468868
S  -3.213534 1.106257 3.046713
S  1.997375 2.050101 -1.297528
P  -3.835847 1.168238 1.233995
P  3.774074 1.561989 -0.769826
O  -4.319403 -0.238775 0.58827
O  4.129108 -0.014752 -0.838376
O  -2.815256 1.773082 0.167234
O  -5.183242 1.950237 0.928699
O  4.981694 2.185182 -1.599554
O  4.216638 1.889926 0.72325
C  -1.401399 -3.076414 -0.181055
C  1.244866 -2.973553 -0.554414
C  -3.364468 -1.206443 0.325188
C  3.167827 -0.998071 -0.721371
C  -1.748672 -2.148843 -1.159087
C  1.506873 -2.158603 0.543673
C  -2.078607 -3.093519 1.0309
C  1.977296 -2.814076 -1.723205
C  -2.726451 -1.203806 -0.90664
C  2.462412 -1.161444 0.461831
C  -3.068619 -2.15422 1.288894
C  2.94456 -1.821728 -1.809377
C  -1.396773 1.844172 0.353718
C  -5.465883 3.199054 1.572789
C  4.927794 2.23594 -3.031872
C  3.96435 3.187015 1.283039
H  -1.237203 -2.145223 -2.112729
H  0.951626 -2.286174 1.463867
H  -1.817975 -3.816572 1.792061
H  1.780437 -3.441793 -2.58195
H  -2.988301 -0.472376 -1.659571
H  2.656925 -0.525314 1.315652
H  -3.588247 -2.15236 2.237517
H  3.503914 -1.679314 -2.724705
H  -1.031722 2.588091 -0.348409
H  -0.931983 0.882759 0.14122
H  -1.144716 2.152568 1.367214
H  -6.447206 3.508321 1.225219
H  -5.486514 3.084085 2.655826
H  -4.733315 3.95816 1.300469
H  4.835145 1.237208 -3.458852
H  4.095861 2.853927 -3.368297
H  5.862851 2.679394 -3.361727
H  2.895017 3.393249 1.318636
H  4.362081 3.170483 2.293587
H  4.467227 3.96805 0.713234
elementType: S P O C H
totalener: -2950.71779278 hartree
nucrepener: 3490.32238744 hartree
electener: -6441.04018022 hartree
twoeener: 4571.02127111 hartree
cpcmener: -0.03351949 hartree
kineticenergy: 2942.58352455 hartree
xcener: -192.750981660784 hartree
chargesum: 0.0000000
charge: -0.086286 -0.453888 -0.453845 0.763476 0.779350 -0.354588 -0.349057 -0.344278 -0.342386 -0.344480 -0.345894 0.046237 0.060361 0.258057 0.230363 -0.114635 -0.145514 -0.146645 -0.151983 -0.200809 -0.163620 -0.182457 -0.173159 -0.075436 -0.119639 -0.117417 -0.117948 0.145473 0.146849 0.138596 0.137660 0.157941 0.155135 0.148059 0.155824 0.128897 0.100086 0.114540 0.131027 0.114154 0.127577 0.126561 0.113372 0.131962 0.112844 0.131367 0.128199
qa: -0.0863 -0.4539 -0.4538 0.7635 0.7793 -0.3546 -0.3491 -0.3443 -0.3424 -0.3445 -0.3459 0.0462 0.0604 0.2581 0.2304 -0.1146 -0.1455 -0.1466 -0.1520 -0.2008 -0.1636 -0.1825 -0.1732 -0.0754 -0.1196 -0.1174 -0.1179 0.1455 0.1468 0.1386 0.1377 0.1579 0.1551 0.1481 0.1558 0.1289 0.1001 0.1145 0.1310 0.1142 0.1276 0.1266 0.1134 0.1320 0.1128 0.1314 0.1282
va: 2.2326 1.9863 1.9786 5.4903 5.4575 2.0994 2.1049 2.0759 2.1120 2.0981 2.0989 3.7033 3.6992 3.6805 3.7050 3.9098 3.9555 3.9748 3.9830 3.9746 3.9757 4.0240 4.0175 3.8229 3.8403 3.8444 3.8413 0.9981 0.9979 1.0123 1.0131 1.0013 1.0068 1.0064 0.9947 0.9889 0.9863 1.0082 0.9910 0.9994 0.9850 0.9843 0.9992 0.9911 0.9980 0.9908 0.9882
dispcorr: -0.026523341 hartree
energy: -2950.744316116847
dipole: 6.06260 -4.60759 1.45500 12.99616 -11.20863 1.78752 -2.65630 1.74072 -0.91558
magnitude: 2.48003 au
magnitude: 6.30374 debye
