program: Orca
programVersion: 5.0.2
elementType: S S S P P O O O O O O C C C C C C C C C C C C C C C C H H H H H H H H H H H H H H H H H H H H
charge: 0
multiplicity: 1
keywords: wb97x-d3
keywords: def2-TZVPP
keywords: def2/J RIJCOSX
keywords: DEFGRID2
keywords: scfconv7
keywords: smallprint printgap noloewdin
keywords: NOSOSCF
formula: C16H20O6P2S3
InChI: InChI=1/C16H20O6P2S3/c1-17-23(25,18-2)21-13-5-9-15(10-6-13)27-16-11-7-14(8-12-16)22-24(26,19-3)20-4/h5-12H,1-4H3
47 atoms
S  0.055423 -3.595085 0.295394
S  -3.849937 1.676408 2.562463
S  3.48711 1.688558 -2.340023
P  -5.057165 1.09012 1.197104
P  4.954035 1.131825 -1.241817
O  -4.409463 0.272011 -0.03764
O  4.924139 -0.407256 -0.745433
O  -5.869612 2.207144 0.407531
O  -6.217577 0.08753 1.625131
O  6.417724 1.207689 -1.864041
O  5.165586 1.876174 0.147669
C  -1.247416 -2.399551 0.209426
C  1.482936 -2.59673 -0.017702
C  -3.36888 -0.62337 0.089476
C  3.761191 -1.106706 -0.501044
C  -2.301207 -2.504661 1.10907
C  1.754293 -1.466206 0.748872
C  -1.271124 -1.402931 -0.762492
C  2.368264 -2.981255 -1.01636
C  -3.373305 -1.627074 1.043869
C  2.886978 -0.710835 0.501704
C  -2.320026 -0.502072 -0.809124
C  3.513816 -2.236927 -1.25894
C  -5.254539 3.446383 0.031401
C  -6.996622 0.340335 2.80279
C  6.672584 0.726683 -3.190103
C  5.046883 3.300079 0.25896
H  -2.295212 -3.270036 1.874364
H  1.079315 -1.166078 1.53971
H  -0.465522 -1.312459 -1.479229
H  2.161398 -3.852419 -1.623813
H  -4.193214 -1.741489 1.74013
H  3.094381 0.162369 1.1065
H  -2.331233 0.283842 -1.553239
H  4.20199 -2.531251 -2.040436
H  -4.437282 3.282265 -0.670391
H  -4.88267 3.979375 0.90573
H  -6.026084 4.040496 -0.450121
H  -7.530761 1.287368 2.726883
H  -7.716671 -0.469648 2.876923
H  -6.367134 0.346819 3.691914
H  7.734081 0.868703 -3.372383
H  6.433995 -0.333483 -3.278803
H  6.10076 1.291446 -3.925588
H  4.060609 3.635889 -0.059459
H  5.18624 3.539028 1.309544
H  5.812791 3.804998 -0.328792
elementType: S P O C H
totalener: -2950.72162337 hartree
nucrepener: 3311.01831035 hartree
electener: -6261.73993372 hartree
twoeener: 4392.39199651 hartree
cpcmener: -0.03575091 hartree
kineticenergy: 2942.57937585 hartree
xcener: -192.752805408040 hartree
chargesum: 0.0000000
charge: -0.050869 -0.449971 -0.449760 0.767294 0.767576 -0.334907 -0.344869 -0.347017 -0.345637 -0.344780 -0.344519 0.037582 0.037923 0.227158 0.228631 -0.156751 -0.143153 -0.137058 -0.133273 -0.166209 -0.161814 -0.188922 -0.185610 -0.116349 -0.116549 -0.115073 -0.115122 0.136992 0.152713 0.151393 0.137553 0.151305 0.155910 0.153195 0.154969 0.128901 0.112260 0.131128 0.129988 0.131204 0.112877 0.131303 0.126455 0.111170 0.111730 0.130941 0.130062
qa: -0.0509 -0.4500 -0.4498 0.7673 0.7676 -0.3349 -0.3449 -0.3470 -0.3456 -0.3448 -0.3445 0.0376 0.0379 0.2272 0.2286 -0.1568 -0.1432 -0.1371 -0.1333 -0.1662 -0.1618 -0.1889 -0.1856 -0.1163 -0.1165 -0.1151 -0.1151 0.1370 0.1527 0.1514 0.1376 0.1513 0.1559 0.1532 0.1550 0.1289 0.1123 0.1311 0.1300 0.1312 0.1129 0.1313 0.1265 0.1112 0.1117 0.1309 0.1301
va: 2.3384 1.9838 1.9832 5.4758 5.4782 2.1230 2.1073 2.0988 2.0896 2.0993 2.0962 3.7464 3.7107 3.7413 3.7195 3.9985 3.9547 3.9075 3.9752 3.9710 3.9723 4.0024 4.0321 3.8372 3.8351 3.8444 3.8354 1.0141 0.9934 0.9912 1.0131 1.0094 1.0055 1.0001 0.9960 0.9849 1.0002 0.9910 0.9890 0.9907 0.9992 0.9907 0.9849 0.9993 0.9997 0.9903 0.9877
dispcorr: -0.023371829 hartree
energy: -2950.744995199870
dipole: -0.36473 0.50664 0.14191 8.88475 -7.86393 1.02082 -0.84265 0.51719 -0.32546
magnitude: 1.08080 au
magnitude: 2.74719 debye
