program: Orca
programVersion: 5.0.2
elementType: S S S P P O O O O O O C C C C C C C C C C C C C C C C H H H H H H H H H H H H H H H H H H H H
charge: 0
multiplicity: 1
keywords: wb97x-d3
keywords: def2-TZVPP
keywords: def2/J RIJCOSX
keywords: DEFGRID2
keywords: scfconv7
keywords: smallprint printgap noloewdin
keywords: NOSOSCF
formula: C16H20O6P2S3
InChI: InChI=1/C16H20O6P2S3/c1-17-23(25,18-2)21-13-5-9-15(10-6-13)27-16-11-7-14(8-12-16)22-24(26,19-3)20-4/h5-12H,1-4H3
47 atoms
S  0.010251 -3.355815 -0.279583
S  -5.239709 1.102985 -1.622176
S  4.073774 2.032592 0.834522
P  -5.513281 0.953257 0.267494
P  5.422828 0.964807 -0.008666
O  -4.242231 0.50073 1.157269
O  4.899414 -0.132052 -1.076649
O  -6.597664 -0.094504 0.778865
O  -5.943009 2.276228 1.042296
O  6.515115 1.72377 -0.881998
O  6.335449 0.057015 0.928976
C  -1.23177 -2.159933 0.120561
C  1.450998 -2.354076 -0.499513
C  -3.27629 -0.403515 0.774978
C  3.751319 -0.868884 -0.858892
C  -0.955091 -0.999263 0.837673
C  1.456528 -1.280376 -1.387091
C  -2.542952 -2.437015 -0.250294
C  2.608753 -2.68416 0.193616
C  -1.97195 -0.112528 1.144941
C  2.601258 -0.521533 -1.551668
C  -3.571759 -1.570449 0.088662
C  3.769997 -1.947725 0.006814
C  -7.873796 -0.202628 0.132906
C  -5.338086 3.538392 0.73081
C  6.13406 2.744934 -1.812989
C  6.861511 0.574377 2.159007
H  0.054365 -0.76916 1.151518
H  0.563047 -1.02225 -1.940429
H  -2.777778 -3.333297 -0.810353
H  2.612389 -3.51255 0.88971
H  -1.75261 0.797931 1.687537
H  2.607344 0.321559 -2.230012
H  -4.585595 -1.823265 -0.191076
H  4.673028 -2.215362 0.539191
H  -7.758504 -0.473368 -0.916217
H  -8.434592 0.728456 0.209813
H  -8.415058 -0.990048 0.649546
H  -5.809092 4.274463 1.37602
H  -4.266528 3.521148 0.928831
H  -5.511289 3.807861 -0.310649
H  5.499282 2.340579 -2.601413
H  5.614162 3.559386 -1.309413
H  7.053066 3.122097 -2.252725
H  6.058416 0.873237 2.831764
H  7.430885 -0.231164 2.613755
H  7.521293 1.42255 1.978634
elementType: S P O C H
totalener: -2950.72149169 hartree
nucrepener: 3286.69395301 hartree
electener: -6237.41544470 hartree
twoeener: 4367.93816390 hartree
cpcmener: -0.03519016 hartree
kineticenergy: 2942.56454990 hartree
xcener: -192.751005788520 hartree
chargesum: -0.0000000
charge: -0.038702 -0.449216 -0.452886 0.765193 0.773854 -0.329948 -0.354499 -0.344684 -0.347387 -0.343967 -0.344503 0.041768 0.051891 0.233217 0.231444 -0.147885 -0.153988 -0.161591 -0.146049 -0.189500 -0.180760 -0.162507 -0.163835 -0.115548 -0.116155 -0.112917 -0.116343 0.150654 0.157320 0.137079 0.138738 0.152342 0.155147 0.140194 0.159261 0.112139 0.130430 0.131095 0.131404 0.127093 0.111754 0.128048 0.109649 0.131524 0.112223 0.130337 0.129072
qa: -0.0387 -0.4492 -0.4529 0.7652 0.7739 -0.3299 -0.3545 -0.3447 -0.3474 -0.3440 -0.3445 0.0418 0.0519 0.2332 0.2314 -0.1479 -0.1540 -0.1616 -0.1460 -0.1895 -0.1808 -0.1625 -0.1638 -0.1155 -0.1162 -0.1129 -0.1163 0.1507 0.1573 0.1371 0.1387 0.1523 0.1551 0.1402 0.1593 0.1121 0.1304 0.1311 0.1314 0.1271 0.1118 0.1280 0.1096 0.1315 0.1122 0.1303 0.1291
va: 2.3697 1.9832 1.9835 5.4791 5.4819 2.1311 2.0984 2.0850 2.1002 2.1011 2.1052 3.7737 3.7183 3.7476 3.7196 3.9122 3.9316 3.9903 4.0067 3.9938 3.9996 3.9622 4.0340 3.8346 3.8412 3.8388 3.8397 0.9929 0.9900 1.0126 1.0134 1.0015 0.9970 1.0150 1.0044 0.9997 0.9888 0.9907 0.9907 0.9856 0.9996 0.9857 1.0005 0.9904 0.9993 0.9906 0.9865
dispcorr: -0.023217488 hartree
energy: -2950.744709183209
dipole: 0.53644 -0.07835 0.45810 7.97440 -7.03401 0.94039 1.78978 -1.43245 0.35732
magnitude: 1.10538 au
magnitude: 2.80965 debye
