program: Orca
programVersion: 5.0.2
elementType: S S S P P O O O O O O C C C C C C C C C C C C C C C C H H H H H H H H H H H H H H H H H H H H
charge: 0
multiplicity: 1
keywords: wb97x-d3
keywords: def2-TZVPP
keywords: def2/J RIJCOSX
keywords: DEFGRID2
keywords: scfconv7
keywords: smallprint printgap noloewdin
keywords: NOSOSCF
formula: C16H20O6P2S3
InChI: InChI=1/C16H20O6P2S3/c1-17-23(25,18-2)21-13-5-9-15(10-6-13)27-16-11-7-14(8-12-16)22-24(26,19-3)20-4/h5-12H,1-4H3
47 atoms
S  0.027099 -2.709986 0.330512
S  -6.076802 -0.062898 1.859261
S  6.683805 -0.945961 -0.233756
P  -6.118064 0.595629 0.061243
P  6.039393 0.853783 -0.12587
O  -4.695242 0.710437 -0.695366
O  4.482821 1.082466 -0.497673
O  -6.693764 2.065309 -0.163706
O  -6.939089 -0.238621 -1.015889
O  6.103759 1.574961 1.292345
O  6.722385 1.939046 -1.07051
C  -1.366618 -1.65705 0.027924
C  1.375423 -1.587792 0.08591
C  -3.616378 -0.107753 -0.424424
C  3.484876 0.160119 -0.277211
C  -1.372282 -0.311175 0.383902
C  2.187082 -1.241206 1.158662
C  -2.501511 -2.219805 -0.54699
C  1.637275 -1.063619 -1.177441
C  -2.495964 0.464842 0.154185
C  3.250568 -0.367633 0.981595
C  -3.633803 -1.449088 -0.767468
C  2.690891 -0.186041 -1.360996
C  -6.334943 3.12975 0.727239
C  -8.260023 -0.716999 -0.730763
C  7.308796 1.523933 2.070525
C  7.077027 1.622834 -2.424571
H  -0.50414 0.143561 0.842593
H  1.986798 -1.638374 2.14484
H  -2.507923 -3.261838 -0.840631
H  1.018894 -1.336689 -2.022588
H  -2.49867 1.512842 0.425343
H  3.861405 -0.086231 1.829332
H  -4.505941 -1.892286 -1.230577
H  2.896313 0.227984 -2.339838
H  -6.789855 4.032794 0.329546
H  -5.25374 3.264326 0.770735
H  -6.719084 2.942513 1.729516
H  -8.249476 -1.414559 0.10618
H  -8.940721 0.105603 -0.512616
H  -8.600023 -1.233107 -1.624381
H  7.123947 2.11231 2.965519
H  7.544575 0.498656 2.353828
H  8.150635 1.954692 1.527318
H  6.211739 1.281551 -2.993723
H  7.454405 2.540907 -2.866884
H  7.855939 0.861155 -2.453169
elementType: S P O C H
totalener: -2950.72177700 hartree
nucrepener: 3234.82535709 hartree
electener: -6185.54713408 hartree
twoeener: 4315.95632975 hartree
cpcmener: -0.03730072 hartree
kineticenergy: 2942.54925414 hartree
xcener: -192.746079433352 hartree
chargesum: 0.0000000
charge: -0.061045 -0.452769 -0.448953 0.768144 0.766431 -0.349741 -0.337202 -0.347166 -0.343878 -0.344864 -0.346473 0.051210 0.046787 0.212715 0.235332 -0.154981 -0.148698 -0.157878 -0.127873 -0.185553 -0.159891 -0.158141 -0.178517 -0.115365 -0.116909 -0.116592 -0.115576 0.155128 0.139383 0.136215 0.148299 0.157094 0.153471 0.156244 0.155817 0.131447 0.125638 0.113007 0.112281 0.127893 0.130989 0.131152 0.112802 0.128770 0.126725 0.131494 0.113595
qa: -0.0610 -0.4528 -0.4490 0.7681 0.7664 -0.3497 -0.3372 -0.3472 -0.3439 -0.3449 -0.3465 0.0512 0.0468 0.2127 0.2353 -0.1550 -0.1487 -0.1579 -0.1279 -0.1856 -0.1599 -0.1581 -0.1785 -0.1154 -0.1169 -0.1166 -0.1156 0.1551 0.1394 0.1362 0.1483 0.1571 0.1535 0.1562 0.1558 0.1314 0.1256 0.1130 0.1123 0.1279 0.1310 0.1312 0.1128 0.1288 0.1267 0.1315 0.1136
va: 2.3138 1.9802 1.9826 5.4788 5.4744 2.1012 2.1184 2.0921 2.0999 2.0930 2.0948 3.7643 3.7002 3.7229 3.7384 3.9023 4.0115 3.9839 3.9470 4.0215 3.9725 4.0079 3.9984 3.8444 3.8410 3.8383 3.8412 0.9889 1.0136 1.0123 0.9971 0.9950 1.0082 1.0045 0.9969 0.9915 0.9839 0.9989 0.9987 0.9875 0.9906 0.9909 0.9988 0.9886 0.9846 0.9916 0.9986
dispcorr: -0.023161059 hartree
energy: -2950.744938057101
dipole: -0.19103 0.34433 0.15330 8.79118 -6.84172 1.94946 -1.73754 1.00539 -0.73216
magnitude: 2.08805 au
magnitude: 5.30741 debye
