program: Orca
programVersion: 5.0.2
elementType: S S S P P O O O O O O C C C C C C C C C C C C C C C C H H H H H H H H H H H H H H H H H H H H
charge: 0
multiplicity: 1
keywords: wb97x-d3
keywords: def2-TZVPP
keywords: def2/J RIJCOSX
keywords: DEFGRID2
keywords: scfconv7
keywords: smallprint printgap noloewdin
keywords: NOSOSCF
formula: C16H20O6P2S3
InChI: InChI=1/C16H20O6P2S3/c1-17-23(25,18-2)21-13-5-9-15(10-6-13)27-16-11-7-14(8-12-16)22-24(26,19-3)20-4/h5-12H,1-4H3
47 atoms
S  -0.114373 -3.893971 -0.414283
S  -2.845582 1.939281 1.852694
S  3.624136 1.43381 -2.604023
P  -4.494263 1.323715 1.0977
P  4.554676 1.191714 -0.946486
O  -4.614591 -0.27011 0.844689
O  4.600462 -0.315023 -0.358752
O  -4.905478 1.869309 -0.339582
O  -5.824237 1.593625 1.92943
O  6.104666 1.55215 -0.921521
O  4.015873 1.988096 0.321689
C  -1.444156 -2.782068 -0.043938
C  1.270294 -2.786172 -0.388757
C  -3.546664 -1.078806 0.536955
C  3.483437 -1.124629 -0.370177
C  -1.723191 -1.703862 -0.879508
C  1.44936 -1.870805 0.644974
C  -2.238811 -3.01068 1.07204
C  2.218917 -2.874534 -1.401214
C  -2.767735 -0.844438 -0.588211
C  2.548011 -1.028226 0.649681
C  -3.294703 -2.158951 1.36452
C  3.331263 -2.045233 -1.391843
C  -4.775994 3.258508 -0.664718
C  -5.869612 1.36875 3.342604
C  6.958306 1.213323 -2.019995
C  3.488101 3.313975 0.197282
H  -1.121283 -1.526353 -1.76141
H  0.728746 -1.802795 1.449974
H  -2.029453 -3.843121 1.73106
H  2.088349 -3.577578 -2.213887
H  -2.979614 -0.014828 -1.250338
H  2.681044 -0.317345 1.454805
H  -3.908863 -2.330107 2.239294
H  4.066864 -2.110994 -2.182936
H  -5.427457 3.872386 -0.042367
H  -5.075629 3.361578 -1.704428
H  -3.744318 3.592233 -0.55313
H  -5.674945 0.323205 3.58466
H  -5.151208 2.001907 3.863424
H  -6.875237 1.626376 3.664933
H  7.007876 0.133642 -2.165242
H  6.618898 1.688091 -2.940562
H  7.948584 1.584439 -1.768671
H  2.630315 3.332703 -0.474589
H  3.170346 3.613368 1.192726
H  4.246254 4.01079 -0.160807
elementType: S P O C H
totalener: -2950.73673572 hartree
nucrepener: 3361.69477735 hartree
electener: -6312.43151307 hartree
twoeener: 4442.98615556 hartree
cpcmener: -0.03076700 hartree
kineticenergy: 2942.56097832 hartree
xcener: -192.747097959594 hartree
chargesum: 0.0000000
charge: -0.064717 -0.444310 -0.448917 0.759530 0.766868 -0.337145 -0.352097 -0.337665 -0.338296 -0.337983 -0.340030 0.034262 0.038419 0.232182 0.238275 -0.122950 -0.141096 -0.138037 -0.141496 -0.164542 -0.170525 -0.177290 -0.180888 -0.117930 -0.117261 -0.115680 -0.116329 0.145531 0.147427 0.135028 0.134474 0.151146 0.153802 0.150343 0.147678 0.127752 0.129262 0.112606 0.125115 0.111156 0.129438 0.125564 0.111860 0.129248 0.113711 0.127752 0.126757
qa: -0.0647 -0.4443 -0.4489 0.7595 0.7669 -0.3371 -0.3521 -0.3377 -0.3383 -0.3380 -0.3400 0.0343 0.0384 0.2322 0.2383 -0.1230 -0.1411 -0.1380 -0.1415 -0.1645 -0.1705 -0.1773 -0.1809 -0.1179 -0.1173 -0.1157 -0.1163 0.1455 0.1474 0.1350 0.1345 0.1511 0.1538 0.1503 0.1477 0.1278 0.1293 0.1126 0.1251 0.1112 0.1294 0.1256 0.1119 0.1292 0.1137 0.1278 0.1268
va: 2.2959 1.9882 1.9875 5.4854 5.4897 2.1178 2.1029 2.1010 2.1065 2.1034 2.1095 3.7133 3.7480 3.7361 3.7192 3.9575 3.9287 3.9779 3.9686 3.9693 4.0322 4.0245 4.0314 3.8408 3.8483 3.8432 3.8451 0.9974 0.9931 1.0139 1.0138 1.0078 1.0055 0.9981 1.0012 0.9883 0.9905 0.9995 0.9848 0.9999 0.9907 0.9855 1.0001 0.9910 0.9992 0.9912 0.9865
dispcorr: -0.023599095 hartree
energy: -2950.760334811380
dipole: -0.88524 0.48371 -0.40153 10.36081 -9.19126 1.16955 1.99375 -1.44297 0.55079
magnitude: 1.35367 au
magnitude: 3.44076 debye
