program: Orca
programVersion: 5.0.2
elementType: S S S P P O O O O O O C C C C C C C C C C C C C C C C H H H H H H H H H H H H H H H H H H H H
charge: 0
multiplicity: 1
keywords: wb97x-d3
keywords: def2-TZVPP
keywords: def2/J RIJCOSX
keywords: DEFGRID2
keywords: scfconv7
keywords: smallprint printgap noloewdin
keywords: NOSOSCF
formula: C16H20O6P2S3
InChI: InChI=1/C16H20O6P2S3/c1-17-23(25,18-2)21-13-5-9-15(10-6-13)27-16-11-7-14(8-12-16)22-24(26,19-3)20-4/h5-12H,1-4H3
47 atoms
S  0.142903 -3.89314 0.431369
S  -3.829414 1.272382 2.722531
S  2.827585 1.984934 -1.789582
P  -4.56552 1.125717 0.959354
P  4.494169 1.35945 -1.083764
O  -4.606889 -0.360916 0.321726
O  4.613391 -0.237398 -0.849958
O  -3.830616 1.922111 -0.206312
O  -6.082461 1.563289 0.760837
O  5.80373 1.635422 -1.945348
O  4.943137 1.888035 0.348445
C  -1.25874 -2.807146 0.385826
C  1.460302 -2.76824 0.053508
C  -3.48678 -1.167077 0.345241
C  3.550497 -1.050623 -0.536441
C  -2.209372 -2.894779 1.396531
C  2.271513 -3.008655 -1.048169
C  -1.44392 -1.904939 -0.658224
C  1.716486 -1.670168 0.870114
C  -3.330038 -2.076974 1.375745
C  3.320023 -2.149622 -1.345627
C  -2.549674 -1.072153 -0.673282
C  2.755231 -0.80471 0.57503
C  -3.289819 3.230223 0.01186
C  -7.07804 1.27943 1.749631
C  5.811041 1.424622 -3.361358
C  4.833401 3.274027 0.691921
H  -2.073721 -3.587733 2.216948
H  2.079623 -3.856381 -1.692923
H  -0.721013 -1.837192 -1.461168
H  1.102909 -1.483071 1.741901
H  -4.067579 -2.142097 2.164824
H  3.945808 -2.330013 -2.21021
H  -2.688032 -0.370475 -1.485382
H  2.949921 0.039248 1.224264
H  -2.541808 3.217935 0.804276
H  -4.07282 3.946205 0.262252
H  -2.818647 3.528343 -0.921091
H  -7.997907 1.745069 1.405341
H  -7.237411 0.206026 1.852594
H  -6.802997 1.700597 2.716362
H  5.617912 0.379893 -3.608199
H  5.073194 2.056461 -3.855799
H  6.804822 1.693474 -3.709944
H  3.812226 3.631719 0.560306
H  5.109032 3.356304 1.739998
H  5.512494 3.882424 0.094469
elementType: S P O C H
totalener: -2950.73641078 hartree
nucrepener: 3362.24533096 hartree
electener: -6312.98174175 hartree
twoeener: 4443.50365568 hartree
cpcmener: -0.03042338 hartree
kineticenergy: 2942.56124291 hartree
xcener: -192.747639742649 hartree
chargesum: 0.0000000
charge: -0.064473 -0.451000 -0.444411 0.769268 0.759476 -0.352516 -0.335971 -0.338802 -0.337338 -0.338109 -0.337454 0.034037 0.032300 0.247536 0.234462 -0.137274 -0.137581 -0.139523 -0.123570 -0.186298 -0.177295 -0.174997 -0.164615 -0.117577 -0.114495 -0.117515 -0.116554 0.134857 0.134933 0.147493 0.145645 0.145691 0.150007 0.153012 0.149526 0.113847 0.127089 0.127607 0.129201 0.126551 0.111060 0.125195 0.111053 0.129419 0.110998 0.129015 0.128087
qa: -0.0645 -0.4510 -0.4444 0.7693 0.7595 -0.3525 -0.3360 -0.3388 -0.3373 -0.3381 -0.3375 0.0340 0.0323 0.2475 0.2345 -0.1373 -0.1376 -0.1395 -0.1236 -0.1863 -0.1773 -0.1750 -0.1646 -0.1176 -0.1145 -0.1175 -0.1166 0.1349 0.1349 0.1475 0.1456 0.1457 0.1500 0.1530 0.1495 0.1138 0.1271 0.1276 0.1292 0.1266 0.1111 0.1252 0.1111 0.1294 0.1110 0.1290 0.1281
va: 2.2979 1.9880 1.9883 5.4910 5.4860 2.1052 2.1199 2.1127 2.1040 2.1076 2.1007 3.7516 3.7163 3.7164 3.7376 3.9668 3.9792 3.9234 3.9569 4.0343 4.0221 4.0332 3.9629 3.8467 3.8393 3.8484 3.8396 1.0136 1.0139 0.9930 0.9972 1.0049 0.9986 1.0059 1.0084 0.9993 0.9861 0.9910 0.9906 0.9856 1.0011 0.9849 1.0001 0.9907 1.0006 0.9901 0.9886
dispcorr: -0.023547738 hartree
energy: -2950.759958520517
dipole: 1.11462 -0.66356 0.45106 10.71281 -9.44124 1.27156 -2.36371 1.70515 -0.65857
magnitude: 1.50135 au
magnitude: 3.81612 debye
