program: Orca
programVersion: 5.0.2
elementType: S S S P P O O O O O O C C C C C C C C C C C C C C C C H H H H H H H H H H H H H H H H H H H H
charge: 0
multiplicity: 1
keywords: wb97x-d3
keywords: def2-TZVPP
keywords: def2/J RIJCOSX
keywords: DEFGRID2
keywords: scfconv7
keywords: smallprint printgap noloewdin
keywords: NOSOSCF
formula: C16H20O6P2S3
InChI: InChI=1/C16H20O6P2S3/c1-17-23(25,18-2)21-13-5-9-15(10-6-13)27-16-11-7-14(8-12-16)22-24(26,19-3)20-4/h5-12H,1-4H3
47 atoms
S  0.0092 -4.033132 0.246701
S  -2.733062 2.06815 1.692407
S  3.364645 1.013971 -2.803266
P  -4.332728 1.404315 0.874256
P  4.277297 1.14149 -1.124174
O  -4.469908 -0.202328 0.755311
O  4.522169 -0.250582 -0.33458
O  -4.621714 1.827327 -0.632474
O  -5.716249 1.762258 1.576548
O  5.754825 1.72921 -1.140546
O  3.584678 1.999054 0.023377
C  -1.318702 -2.86431 0.384464
C  1.380545 -2.917374 0.100412
C  -3.407019 -1.062227 0.615253
C  3.484415 -1.147823 -0.181411
C  -2.217957 -2.970062 1.438033
C  2.265557 -3.05183 -0.962143
C  -1.486962 -1.861101 -0.566783
C  1.581228 -1.914936 1.04576
C  -3.267531 -2.069634 1.55367
C  3.327297 -2.168902 -1.102356
C  -2.522825 -0.951327 -0.449481
C  2.624347 -1.018004 0.899551
C  -4.490507 3.192348 -1.046982
C  -5.860923 1.66521 2.997517
C  6.672366 1.401413 -2.189492
C  2.997415 3.274433 -0.257317
H  -2.092505 -3.739616 2.188719
H  2.119184 -3.829477 -1.700528
H  -0.806669 -1.780047 -1.405076
H  0.909435 -1.813724 1.888459
H  -3.96078 -2.142063 2.382005
H  4.011076 -2.265583 -1.935355
H  -2.64586 -0.177931 -1.196986
H  2.772557 -0.232825 1.629239
H  -5.214806 3.830056 -0.53878
H  -4.686519 3.211613 -2.116137
H  -3.482603 3.564582 -0.859864
H  -5.191592 2.358995 3.507056
H  -6.891432 1.928941 3.223515
H  -5.667734 0.650195 3.348438
H  6.881146 0.330832 -2.213427
H  6.288249 1.719146 -3.159484
H  7.592678 1.939154 -1.973221
H  2.547978 3.618849 0.671034
H  3.752807 3.9929 -0.578435
H  2.22402 3.191559 -1.021849
elementType: S P O C H
totalener: -2950.73624841 hartree
nucrepener: 3391.09235976 hartree
electener: -6341.82860817 hartree
twoeener: 4472.43841023 hartree
cpcmener: -0.03044200 hartree
kineticenergy: 2942.56374244 hartree
xcener: -192.747324002688 hartree
chargesum: -0.0000000
charge: -0.065961 -0.445029 -0.448587 0.759136 0.767164 -0.336179 -0.352562 -0.336953 -0.339108 -0.336991 -0.336249 0.031695 0.032343 0.229118 0.251251 -0.140233 -0.131863 -0.124531 -0.129067 -0.176115 -0.187642 -0.166485 -0.175758 -0.118200 -0.117122 -0.113843 -0.116710 0.134231 0.134458 0.145438 0.145029 0.149827 0.146190 0.150264 0.153798 0.127724 0.129246 0.111235 0.111849 0.129415 0.124022 0.126065 0.111591 0.128897 0.127408 0.126176 0.111618
qa: -0.0660 -0.4450 -0.4486 0.7591 0.7672 -0.3362 -0.3526 -0.3370 -0.3391 -0.3370 -0.3362 0.0317 0.0323 0.2291 0.2513 -0.1402 -0.1319 -0.1245 -0.1291 -0.1761 -0.1876 -0.1665 -0.1758 -0.1182 -0.1171 -0.1138 -0.1167 0.1342 0.1345 0.1454 0.1450 0.1498 0.1462 0.1503 0.1538 0.1277 0.1292 0.1112 0.1118 0.1294 0.1240 0.1261 0.1116 0.1289 0.1274 0.1262 0.1116
va: 2.2884 1.9877 1.9911 5.4850 5.4950 2.1185 2.1036 2.1028 2.1037 2.1032 2.1173 3.7227 3.7223 3.7349 3.7106 3.9795 3.9655 3.9425 3.9279 4.0256 4.0327 3.9725 4.0307 3.8421 3.8497 3.8402 3.8484 1.0140 1.0137 0.9959 0.9950 0.9981 1.0043 1.0090 1.0054 0.9884 0.9904 1.0000 0.9996 0.9910 0.9848 0.9855 1.0005 0.9911 0.9903 0.9864 1.0001
dispcorr: -0.023881608 hartree
energy: -2950.760130019378
dipole: -1.40219 1.07983 -0.32237 11.36109 -9.95413 1.40696 0.52734 -0.19598 0.33136
magnitude: 1.48096 au
magnitude: 3.76430 debye
