program: Orca
programVersion: 5.0.2
elementType: S S S P P O O O O O O C C C C C C C C C C C C C C C C H H H H H H H H H H H H H H H H H H H H
charge: 0
multiplicity: 1
keywords: wb97x-d3
keywords: def2-TZVPP
keywords: def2/J RIJCOSX
keywords: DEFGRID2
keywords: scfconv7
keywords: smallprint printgap noloewdin
keywords: NOSOSCF
formula: C16H20O6P2S3
InChI: InChI=1/C16H20O6P2S3/c1-17-23(25,18-2)21-13-5-9-15(10-6-13)27-16-11-7-14(8-12-16)22-24(26,19-3)20-4/h5-12H,1-4H3
47 atoms
S  -0.041812 -3.191835 -0.74356
S  -6.309363 -0.293931 -1.183658
S  7.207975 1.420104 0.864943
P  -5.489666 1.017593 -0.052039
P  5.423059 0.980134 0.337686
O  -4.348967 0.485595 0.963453
O  5.112719 -0.591878 0.541329
O  -6.4340 1.794657 0.96597
O  -4.718925 2.214373 -0.763886
O  4.207766 1.630587 1.132651
O  5.019074 1.315355 -1.169708
C  -1.281725 -2.04854 -0.205487
C  1.463135 -2.345155 -0.354129
C  -3.339801 -0.356857 0.54536
C  3.88727 -1.148766 0.228577
C  -2.4386 -2.564971 0.369253
C  1.728218 -1.897621 0.937991
C  -1.163909 -0.675475 -0.40091
C  2.426422 -2.20076 -1.344937
C  -3.477287 -1.7210 0.732358
C  2.933431 -1.283153 1.22744
C  -2.187181 0.173887 -0.014408
C  3.647944 -1.608991 -1.054044
C  -7.395479 1.098924 1.766418
C  -5.258358 2.871117 -1.915845
C  4.135175 3.045138 1.339987
C  5.953632 1.150902 -2.24114
H  -2.536999 -3.629543 0.539707
H  0.993048 -2.021815 1.722693
H  -0.274079 -0.257291 -0.853245
H  2.228511 -2.542838 -2.352537
H  -4.376264 -2.124386 1.179641
H  3.140349 -0.93557 2.231195
H  -2.083065 1.242482 -0.150096
H  4.401454 -1.513121 -1.825336
H  -6.908351 0.41506 2.462476
H  -8.098399 0.543984 1.14472
H  -7.935904 1.854728 2.330585
H  -6.17803 3.402724 -1.670208
H  -4.508637 3.587093 -2.242573
H  -5.451616 2.160653 -2.719428
H  3.300261 3.219029 2.013734
H  5.049813 3.422384 1.798883
H  3.954869 3.570498 0.401962
H  6.329999 0.128923 -2.295931
H  5.416943 1.381376 -3.158084
H  6.793233 1.837336 -2.132293
elementType: S P O C H
totalener: -2950.73653407 hartree
nucrepener: 3287.75784564 hartree
electener: -6238.49437970 hartree
twoeener: 4368.01827068 hartree
cpcmener: -0.03252221 hartree
kineticenergy: 2942.55917627 hartree
xcener: -192.746939690489 hartree
chargesum: -0.0000000
charge: -0.043713 -0.448393 -0.429859 0.762680 0.716046 -0.351907 -0.344779 -0.335914 -0.337025 -0.321676 -0.333752 0.035417 0.027304 0.234511 0.259703 -0.139323 -0.128331 -0.148583 -0.143832 -0.182278 -0.184392 -0.171453 -0.179064 -0.113690 -0.116334 -0.111790 -0.118271 0.134967 0.151593 0.153089 0.136031 0.147367 0.149353 0.153889 0.157103 0.126117 0.109151 0.129174 0.126718 0.126707 0.112061 0.126149 0.107549 0.124330 0.123262 0.132797 0.121290
qa: -0.0437 -0.4484 -0.4299 0.7627 0.7160 -0.3519 -0.3448 -0.3359 -0.3370 -0.3217 -0.3338 0.0354 0.0273 0.2345 0.2597 -0.1393 -0.1283 -0.1486 -0.1438 -0.1823 -0.1844 -0.1715 -0.1791 -0.1137 -0.1163 -0.1118 -0.1183 0.1350 0.1516 0.1531 0.1360 0.1474 0.1494 0.1539 0.1571 0.1261 0.1092 0.1292 0.1267 0.1267 0.1121 0.1261 0.1075 0.1243 0.1233 0.1328 0.1213
va: 2.3486 1.9919 2.0254 5.5024 5.5251 2.1030 2.1175 2.1060 2.1154 2.1047 2.0575 3.7693 3.7429 3.7312 3.7341 3.9607 3.9216 3.9261 3.9959 4.0374 4.0107 4.0360 4.0296 3.8427 3.8469 3.8456 3.8265 1.0125 0.9922 0.9898 1.0153 1.0026 1.0032 1.0065 0.9891 0.9862 1.0008 0.9903 0.9862 0.9905 1.0002 0.9892 1.0006 0.9886 0.9852 0.9901 1.0046
dispcorr: -0.023495818 hartree
energy: -2950.760029884773
dipole: -6.14845 4.98252 -1.16593 11.09226 -9.41327 1.67899 -3.30897 2.82178 -0.48719
magnitude: 2.10137 au
magnitude: 5.34126 debye
