program: Orca
programVersion: 5.0.2
elementType: S S S P P O O O O O O C C C C C C C C C C C C C C C C H H H H H H H H H H H H H H H H H H H H
charge: 0
multiplicity: 1
keywords: wb97x-d3
keywords: def2-TZVPP
keywords: def2/J RIJCOSX
keywords: DEFGRID2
keywords: scfconv7
keywords: smallprint printgap noloewdin
keywords: NOSOSCF
formula: C16H20O6P2S3
InChI: InChI=1/C16H20O6P2S3/c1-17-23(25,18-2)21-13-5-9-15(10-6-13)27-16-11-7-14(8-12-16)22-24(26,19-3)20-4/h5-12H,1-4H3
47 atoms
S  -0.025326 -3.216172 0.719056
S  -6.972728 1.59196 -1.410418
S  6.255674 -0.554587 1.076456
P  -5.466379 0.904374 -0.453427
P  5.445572 1.02612 0.359167
O  -5.057069 -0.57669 -0.951606
O  4.121098 0.80512 -0.54359
O  -5.61574 0.661803 1.112399
O  -4.121095 1.763046 -0.509722
O  4.913306 2.113333 1.393154
O  6.323164 1.916998 -0.626165
C  -1.510306 -2.394162 0.210238
C  1.200838 -1.994453 0.339118
C  -3.877162 -1.176033 -0.548448
C  3.167022 -0.136052 -0.224809
C  -1.574038 -1.669199 -0.976856
C  1.117803 -0.708523 0.866671
C  -2.647822 -2.523998 0.99835
C  2.277617 -2.34182 -0.46745
C  -2.752208 -1.046021 -1.348533
C  2.095889 0.226925 0.578296
C  -3.839069 -1.922815 0.61624
C  3.272689 -1.414529 -0.742884
C  -6.102097 1.697404 1.972938
C  -3.737405 2.45678 -1.701646
C  5.71293 2.496111 2.518726
C  7.09598 1.304454 -1.665676
H  -0.703413 -1.575674 -1.612896
H  0.286619 -0.429356 1.501051
H  -2.610783 -3.082669 1.924947
H  2.344744 -3.335503 -0.890646
H  -2.798608 -0.477903 -2.268971
H  2.025476 1.231122 0.975679
H  -4.722269 -2.034314 1.231015
H  4.110137 -1.682646 -1.373271
H  -5.407448 2.536561 2.012388
H  -6.19269 1.261904 2.964534
H  -7.080664 2.050743 1.646635
H  -4.389415 3.312302 -1.875459
H  -2.719979 2.804694 -1.543003
H  -3.756508 1.808568 -2.577807
H  6.685463 2.877805 2.206434
H  5.169633 3.287396 3.028531
H  5.853539 1.656898 3.199705
H  7.927321 0.736357 -1.2490
H  6.485839 0.649462 -2.289006
H  7.484391 2.112771 -2.280044
elementType: S P O C H
totalener: -2950.73595429 hartree
nucrepener: 3297.07420269 hartree
electener: -6247.81015699 hartree
twoeener: 4377.20221784 hartree
cpcmener: -0.03293366 hartree
kineticenergy: 2942.56705029 hartree
xcener: -192.747569470165 hartree
chargesum: -0.0000000
charge: -0.050786 -0.429809 -0.445281 0.713732 0.764138 -0.344384 -0.354766 -0.324698 -0.334675 -0.339163 -0.335883 0.034507 0.034125 0.240565 0.251142 -0.147455 -0.131572 -0.145763 -0.135640 -0.192820 -0.175718 -0.166622 -0.178164 -0.111511 -0.120033 -0.118826 -0.114766 0.151343 0.149964 0.135022 0.136245 0.161749 0.153180 0.150282 0.148651 0.124281 0.126417 0.108017 0.125227 0.134898 0.121402 0.124420 0.128142 0.114076 0.113785 0.122617 0.130408
qa: -0.0508 -0.4298 -0.4453 0.7137 0.7641 -0.3444 -0.3548 -0.3247 -0.3347 -0.3392 -0.3359 0.0345 0.0341 0.2406 0.2511 -0.1475 -0.1316 -0.1458 -0.1356 -0.1928 -0.1757 -0.1666 -0.1782 -0.1115 -0.1200 -0.1188 -0.1148 0.1513 0.1500 0.1350 0.1362 0.1617 0.1532 0.1503 0.1487 0.1243 0.1264 0.1080 0.1252 0.1349 0.1214 0.1244 0.1281 0.1141 0.1138 0.1226 0.1304
va: 2.3257 2.0263 1.9903 5.5262 5.4948 2.1149 2.1004 2.1038 2.0480 2.1141 2.0989 3.7579 3.7270 3.7332 3.7202 3.9260 3.9384 3.9711 3.9803 4.0117 4.0440 4.0344 4.0185 3.8455 3.8249 3.8510 3.8480 0.9916 0.9933 1.0131 1.0137 0.9887 1.0047 1.0040 1.0013 0.9882 0.9894 1.0008 1.0031 0.9906 0.9867 0.9866 0.9912 0.9981 0.9982 0.9855 0.9917
dispcorr: -0.023829387 hartree
energy: -2950.759783681166
dipole: 7.85750 -6.12300 1.73450 11.26746 -9.46605 1.80141 2.07752 -1.80872 0.26880
magnitude: 2.51512 au
magnitude: 6.39293 debye
