program: Orca
programVersion: 5.0.2
elementType: S S S P P O O O O O O C C C C C C C C C C C C C C C C H H H H H H H H H H H H H H H H H H H H
charge: 0
multiplicity: 1
keywords: wb97x-d3
keywords: def2-TZVPP
keywords: def2/J RIJCOSX
keywords: DEFGRID2
keywords: scfconv7
keywords: smallprint printgap noloewdin
keywords: NOSOSCF
formula: C16H20O6P2S3
InChI: InChI=1/C16H20O6P2S3/c1-17-23(25,18-2)21-13-5-9-15(10-6-13)27-16-11-7-14(8-12-16)22-24(26,19-3)20-4/h5-12H,1-4H3
47 atoms
S  -0.048574 -2.563008 -0.384855
S  -6.714757 -0.751101 -0.769481
S  6.879794 -1.137908 0.125032
P  -6.226105 0.65121 0.439475
P  6.224272 0.619474 -0.257261
O  -4.658418 1.029948 0.512504
O  4.697194 0.925013 0.173567
O  -6.538979 0.434757 1.984927
O  -6.859548 2.090126 0.189894
O  6.964817 1.841587 0.442113
O  6.185388 1.092012 -1.776713
C  -1.406215 -1.459295 -0.099049
C  1.3497 -1.483596 -0.231675
C  -3.613915 0.161974 0.308771
C  3.623813 0.086501 0.007014
C  -2.395433 -1.835804 0.80141
C  1.545057 -0.70262 0.904642
C  -1.532575 -0.261853 -0.798516
C  2.303034 -1.471016 -1.241367
C  -3.507336 -1.030648 1.004559
C  2.675905 0.084841 1.022175
C  -2.632696 0.551547 -0.5917
C  3.446227 -0.692136 -1.125762
C  -7.828228 -0.013444 2.415453
C  -6.934185 2.646564 -1.125802
C  7.447408 1.758456 1.786055
C  7.295814 0.869596 -2.651939
H  -2.301603 -2.757372 1.361182
H  0.816585 -0.708298 1.705458
H  -0.774867 0.039038 -1.510813
H  2.157483 -2.062512 -2.136004
H  -4.260365 -1.326404 1.723649
H  2.828253 0.694122 1.903992
H  -2.733669 1.483823 -1.132938
H  4.161801 -0.684611 -1.937036
H  -8.597338 0.727105 2.193005
H  -7.766798 -0.150379 3.492242
H  -8.092192 -0.962375 1.947397
H  -7.544049 2.024985 -1.781767
H  -7.399578 3.624048 -1.024295
H  -5.942015 2.769388 -1.562686
H  6.630022 1.610883 2.492682
H  8.171478 0.950897 1.894382
H  7.93429 2.707247 1.998314
H  8.180934 1.409355 -2.313146
H  7.526617 -0.192989 -2.732722
H  7.00129 1.246589 -3.628356
elementType: S P O C H
totalener: -2950.73641081 hartree
nucrepener: 3216.18230241 hartree
electener: -6166.91871322 hartree
twoeener: 4297.04392730 hartree
cpcmener: -0.03161727 hartree
kineticenergy: 2942.55129510 hartree
xcener: -192.748519950550 hartree
chargesum: -0.0000000
charge: -0.061001 -0.443337 -0.440778 0.754480 0.749207 -0.330920 -0.320076 -0.337076 -0.338707 -0.339272 -0.337440 0.030488 0.023425 0.227728 0.241970 -0.150568 -0.114406 -0.124443 -0.158564 -0.154513 -0.192097 -0.183642 -0.157422 -0.116483 -0.116337 -0.115625 -0.116977 0.134723 0.148653 0.149042 0.135359 0.145393 0.148606 0.150698 0.142508 0.127052 0.128784 0.110443 0.110582 0.128935 0.124362 0.125575 0.111921 0.128734 0.129608 0.112106 0.129301
qa: -0.0610 -0.4433 -0.4408 0.7545 0.7492 -0.3309 -0.3201 -0.3371 -0.3387 -0.3393 -0.3374 0.0305 0.0234 0.2277 0.2420 -0.1506 -0.1144 -0.1244 -0.1586 -0.1545 -0.1921 -0.1836 -0.1574 -0.1165 -0.1163 -0.1156 -0.1170 0.1347 0.1487 0.1490 0.1354 0.1454 0.1486 0.1507 0.1425 0.1271 0.1288 0.1104 0.1106 0.1289 0.1244 0.1256 0.1119 0.1287 0.1296 0.1121 0.1293
va: 2.3056 1.9901 1.9936 5.4920 5.4972 2.1248 2.1438 2.0990 2.1048 2.1065 2.0923 3.7430 3.7440 3.7529 3.7628 4.0051 3.9208 3.9233 4.0268 3.9778 3.9957 4.0043 3.9612 3.8411 3.8498 3.8427 3.8366 1.0159 0.9924 0.9920 1.0166 1.0110 1.0027 0.9995 1.0137 0.9890 0.9900 1.0002 0.9997 0.9909 0.9849 0.9855 1.0000 0.9910 0.9892 1.0002 0.9902
dispcorr: -0.022785812 hartree
energy: -2950.759196619403
dipole: 0.05154 0.03947 0.09101 9.18263 -6.99815 2.18448 0.68715 -0.40437 0.28278
magnitude: 2.20459 au
magnitude: 5.60361 debye
