program: Orca
programVersion: 5.0.2
elementType: S S S P P O O O O O O C C C C C C C C C C C C C C C C H H H H H H H H H H H H H H H H H H H H
charge: 0
multiplicity: 1
keywords: wb97x-d3
keywords: def2-TZVPP
keywords: def2/J RIJCOSX
keywords: DEFGRID2
keywords: scfconv7
keywords: smallprint printgap noloewdin
keywords: NOSOSCF
formula: C16H20O6P2S3
InChI: InChI=1/C16H20O6P2S3/c1-17-23(25,18-2)21-13-5-9-15(10-6-13)27-16-11-7-14(8-12-16)22-24(26,19-3)20-4/h5-12H,1-4H3
47 atoms
S  -0.057734 -3.030086 0.936831
S  -4.218108 2.617242 -0.468243
S  6.60991 -0.692906 0.592709
P  -5.435838 1.200147 -0.057031
P  5.795645 0.569618 -0.587332
O  -5.075084 -0.285931 -0.585119
O  4.21187 0.851818 -0.339168
O  -6.860024 1.414682 -0.724132
O  -5.670719 0.885098 1.4910
O  6.326798 2.068359 -0.570268
O  5.932386 0.179593 -2.119551
C  -1.526112 -2.156483 0.469107
C  1.210683 -1.861641 0.536545
C  -3.892084 -0.900034 -0.225917
C  3.25928 -0.090724 -0.057077
C  -2.678846 -2.3707 1.217737
C  2.190065 -2.206732 -0.384723
C  -1.573291 -1.321142 -0.643264
C  1.267782 -0.621071 1.166963
C  -3.867211 -1.746851 0.868918
C  3.221221 -1.326578 -0.683304
C  -2.752927 -0.681046 -0.984378
C  2.285294 0.265699 0.867197
C  -7.933411 0.470599 -0.597405
C  -5.752157 1.92979 2.46476
C  6.454475 2.798984 0.654529
C  5.329696 0.942563 -3.176681
H  -2.655501 -3.015002 2.087599
H  2.151327 -3.163229 -0.889211
H  -0.691095 -1.157159 -1.248216
H  0.516728 -0.342587 1.89468
H  -4.761912 -1.918158 1.453059
H  3.959678 -1.609996 -1.421513
H  -2.78797 -0.029671 -1.847551
H  2.329331 1.231753 1.353534
H  -8.025161 0.087107 0.418619
H  -7.797661 -0.359284 -1.289687
H  -8.845647 1.003444 -0.853787
H  -6.560159 2.625106 2.238119
H  -5.955314 1.448271 3.417481
H  -4.811894 2.475815 2.531089
H  7.069312 2.256372 1.372975
H  6.93959 3.739746 0.407691
H  5.477582 3.004341 1.093049
H  5.858249 1.883126 -3.325872
H  5.41337 0.339995 -4.077021
H  4.27578 1.141524 -2.983764
elementType: S P O C H
totalener: -2950.73583590 hartree
nucrepener: 3281.18038884 hartree
electener: -6231.91622473 hartree
twoeener: 4361.65042193 hartree
cpcmener: -0.03433570 hartree
kineticenergy: 2942.55190938 hartree
xcener: -192.747672543900 hartree
chargesum: -0.0000000
charge: -0.052360 -0.431051 -0.419770 0.725994 0.718694 -0.352982 -0.328018 -0.333260 -0.330483 -0.333533 -0.337972 0.032759 0.028143 0.266209 0.263520 -0.143266 -0.145824 -0.138353 -0.119272 -0.185676 -0.159793 -0.204764 -0.193688 -0.111793 -0.112373 -0.109142 -0.116648 0.133963 0.136587 0.152726 0.147994 0.148510 0.138761 0.146646 0.150265 0.118693 0.119568 0.126747 0.126588 0.126742 0.115391 0.106982 0.128562 0.124775 0.126789 0.127681 0.120729
qa: -0.0524 -0.4311 -0.4198 0.7260 0.7187 -0.3530 -0.3280 -0.3333 -0.3305 -0.3335 -0.3380 0.0328 0.0281 0.2662 0.2635 -0.1433 -0.1458 -0.1384 -0.1193 -0.1857 -0.1598 -0.2048 -0.1937 -0.1118 -0.1124 -0.1091 -0.1166 0.1340 0.1366 0.1527 0.1480 0.1485 0.1388 0.1466 0.1503 0.1187 0.1196 0.1267 0.1266 0.1267 0.1154 0.1070 0.1286 0.1248 0.1268 0.1277 0.1207
va: 2.3327 2.0281 2.0299 5.5237 5.5143 2.0872 2.0773 2.1068 2.0625 2.0974 2.0934 3.7847 3.7306 3.6944 3.7399 3.9584 4.0093 3.9043 3.9476 4.0558 3.9560 4.0449 4.0063 3.8494 3.8392 3.8430 3.8383 1.0126 1.0153 0.9896 0.9949 1.0050 1.0165 1.0094 1.0002 0.9925 0.9905 0.9897 0.9858 0.9918 1.0011 1.0011 0.9893 0.9879 0.9935 0.9890 0.9915
dispcorr: -0.023915803 hartree
energy: -2950.759751701230
dipole: -8.81892 6.67991 -2.13901 7.41545 -6.36692 1.04853 1.29488 -1.09759 0.19730
magnitude: 2.39034 au
magnitude: 6.07576 debye
