program: Orca
programVersion: 5.0.2
elementType: S S S P P O O O O O O C C C C C C C C C C C C C C C C H H H H H H H H H H H H H H H H H H H H
charge: 0
multiplicity: 1
keywords: wb97x-d3
keywords: def2-TZVPP
keywords: def2/J RIJCOSX
keywords: DEFGRID2
keywords: scfconv7
keywords: smallprint printgap noloewdin
keywords: NOSOSCF
formula: C16H20O6P2S3
InChI: InChI=1/C16H20O6P2S3/c1-17-23(25,18-2)21-13-5-9-15(10-6-13)27-16-11-7-14(8-12-16)22-24(26,19-3)20-4/h5-12H,1-4H3
47 atoms
S  -0.049626 -3.381806 -0.349466
S  -3.676387 2.284314 1.117556
S  4.457313 1.187778 -2.884648
P  -5.169185 1.096841 0.934653
P  5.3311 0.938645 -1.201577
O  -4.907085 -0.45367 1.319448
O  4.362417 0.540715 0.041546
O  -5.798507 0.931773 -0.517799
O  -6.457156 1.401996 1.818857
O  6.458161 -0.177392 -1.256759
O  6.097217 2.17276 -0.548451
C  -1.481092 -2.47064 0.153169
C  1.234848 -2.16919 -0.227114
C  -3.764405 -1.112432 0.918678
C  3.335467 -0.368632 -0.084642
C  -1.554877 -1.884328 1.415048
C  2.51582 -2.609612 0.090615
C  -2.565415 -2.386293 -0.710268
C  1.016979 -0.817982 -0.481781
C  -2.689362 -1.188236 1.793111
C  3.572152 -1.712453 0.148767
C  -3.717335 -1.712392 -0.326897
C  2.064254 0.084171 -0.400608
C  -5.99418 2.060936 -1.378986
C  -6.339561 1.780567 3.195743
C  7.30795 -0.477518 -0.138099
C  5.432202 3.418061 -0.312586
H  -0.722274 -1.95623 2.102996
H  2.700456 -3.655504 0.301917
H  -2.517636 -2.837924 -1.692414
H  0.031165 -0.455303 -0.742039
H  -2.745089 -0.724065 2.769087
H  4.56459 -2.062899 0.403123
H  -4.562143 -1.657553 -1.000624
H  1.888504 1.135723 -0.58508
H  -6.319047 1.665531 -2.337885
H  -5.066637 2.617223 -1.514972
H  -6.763339 2.724927 -0.984355
H  -5.962601 0.953344 3.798109
H  -5.683356 2.643304 3.312544
H  -7.339475 2.04206 3.532369
H  8.135394 0.229127 -0.090537
H  6.767215 -0.467655 0.808121
H  7.701066 -1.477035 -0.306103
H  4.729056 3.334131 0.516132
H  6.201721 4.141614 -0.056091
H  4.904305 3.75939 -1.20399
elementType: S P O C H
totalener: -2950.73671245 hartree
nucrepener: 3302.64337492 hartree
electener: -6253.38008737 hartree
twoeener: 4383.59529516 hartree
cpcmener: -0.03340400 hartree
kineticenergy: 2942.54169779 hartree
xcener: -192.744338675563 hartree
chargesum: -0.0000000
charge: -0.044472 -0.448393 -0.428134 0.767373 0.728036 -0.352237 -0.357549 -0.337727 -0.336661 -0.341088 -0.330798 0.035268 0.046349 0.250631 0.244649 -0.132649 -0.156124 -0.133825 -0.140449 -0.183598 -0.165358 -0.172643 -0.185849 -0.115987 -0.113841 -0.126599 -0.104868 0.151215 0.133133 0.136032 0.149293 0.149254 0.155083 0.153870 0.143072 0.127493 0.111318 0.127060 0.126729 0.109513 0.129364 0.128095 0.119415 0.130349 0.123829 0.128095 0.104331
qa: -0.0445 -0.4484 -0.4281 0.7674 0.7280 -0.3522 -0.3575 -0.3377 -0.3367 -0.3411 -0.3308 0.0353 0.0463 0.2506 0.2446 -0.1326 -0.1561 -0.1338 -0.1404 -0.1836 -0.1654 -0.1726 -0.1858 -0.1160 -0.1138 -0.1266 -0.1049 0.1512 0.1331 0.1360 0.1493 0.1493 0.1551 0.1539 0.1431 0.1275 0.1113 0.1271 0.1267 0.1095 0.1294 0.1281 0.1194 0.1303 0.1238 0.1281 0.1043
va: 2.3518 1.9902 2.0238 5.4947 5.5173 2.1037 2.0499 2.1172 2.1073 2.1098 2.0890 3.7324 3.7703 3.7206 3.7224 3.9313 3.9849 3.9953 3.9043 4.0046 4.0465 4.0509 4.0377 3.8451 3.8402 3.8452 3.8378 0.9935 1.0132 1.0139 0.9928 1.0020 0.9901 1.0052 1.0056 0.9900 1.0006 0.9863 0.9861 1.0017 0.9902 0.9933 0.9907 0.9886 0.9902 0.9891 1.0031
dispcorr: -0.023879716 hartree
energy: -2950.760592169665
dipole: -0.40404 -0.06726 -0.47130 7.30033 -6.63280 0.66753 7.32449 -5.20706 2.11743
magnitude: 2.26963 au
magnitude: 5.76894 debye
