program: Orca
programVersion: 5.0.2
elementType: S S S P P O O O O O O C C C C C C C C C C C C C C C C H H H H H H H H H H H H H H H H H H H H
charge: 0
multiplicity: 1
keywords: wb97x-d3
keywords: def2-TZVPP
keywords: def2/J RIJCOSX
keywords: DEFGRID2
keywords: scfconv7
keywords: smallprint printgap noloewdin
keywords: NOSOSCF
formula: C16H20O6P2S3
InChI: InChI=1/C16H20O6P2S3/c1-17-23(25,18-2)21-13-5-9-15(10-6-13)27-16-11-7-14(8-12-16)22-24(26,19-3)20-4/h5-12H,1-4H3
47 atoms
S  -0.166195 -3.262045 -0.813003
S  -4.557303 2.063421 -0.479333
S  5.295433 0.859309 -2.42639
P  -5.449084 1.020361 0.85683
P  5.490251 0.924162 -0.52299
O  -4.582835 -0.141561 1.574765
O  4.809225 -0.278531 0.313688
O  -6.721271 0.171433 0.415905
O  -6.003289 1.796608 2.130614
O  6.969001 0.871737 0.062854
O  4.888567 2.180701 0.246338
C  -1.455139 -2.280422 -0.101888
C  1.286075 -2.310324 -0.471838
C  -3.564847 -0.844224 0.977639
C  3.634271 -0.914878 0.00224
C  -1.340109 -1.714387 1.16526
C  1.32539 -0.928168 -0.631174
C  -2.640118 -2.133554 -0.812507
C  2.437407 -2.987204 -0.084859
C  -2.384287 -0.977653 1.694484
C  2.490051 -0.224426 -0.374947
C  -3.706014 -1.431165 -0.269035
C  3.616909 -2.293165 0.132635
C  -7.748513 0.756195 -0.392681
C  -5.275438 2.88572 2.708009
C  7.957497 0.006706 -0.506272
C  5.117475 3.510816 -0.233431
H  -0.43067 -1.831045 1.740304
H  0.442421 -0.384382 -0.941243
H  -2.74236 -2.56361 -1.800702
H  2.421787 -4.060721 0.053818
H  -2.288461 -0.519639 2.67072
H  2.487688 0.853654 -0.468285
H  -4.628193 -1.348927 -0.829315
H  4.513406 -2.822035 0.429996
H  -8.516676 -0.003237 -0.513068
H  -7.362682 1.035813 -1.373112
H  -8.186296 1.631554 0.088123
H  -5.817712 3.178281 3.603627
H  -4.263283 2.590059 2.986067
H  -5.230793 3.731301 2.022138
H  8.188633 0.299456 -1.530157
H  8.849152 0.110443 0.106788
H  7.634201 -1.034781 -0.489885
H  4.648564 4.182174 0.481332
H  6.182682 3.737746 -0.287656
H  4.664491 3.656367 -1.214136
elementType: S P O C H
totalener: -2950.73604735 hartree
nucrepener: 3269.32998924 hartree
electener: -6220.06603659 hartree
twoeener: 4350.30792271 hartree
cpcmener: -0.03156091 hartree
kineticenergy: 2942.56673143 hartree
xcener: -192.752781900806 hartree
chargesum: -0.0000000
charge: -0.037547 -0.441474 -0.441229 0.752629 0.751139 -0.330222 -0.325562 -0.337074 -0.340084 -0.339656 -0.337675 0.040293 0.036617 0.230807 0.227279 -0.151135 -0.167749 -0.149097 -0.138887 -0.174332 -0.149891 -0.162219 -0.179916 -0.117781 -0.116366 -0.116569 -0.117398 0.153828 0.154711 0.135851 0.135024 0.149046 0.141889 0.142785 0.148574 0.129442 0.113070 0.126288 0.129171 0.123841 0.114018 0.113468 0.129132 0.123466 0.129955 0.126585 0.112953
qa: -0.0375 -0.4415 -0.4412 0.7526 0.7511 -0.3302 -0.3256 -0.3371 -0.3401 -0.3397 -0.3377 0.0403 0.0366 0.2308 0.2273 -0.1511 -0.1677 -0.1491 -0.1389 -0.1743 -0.1499 -0.1622 -0.1799 -0.1178 -0.1164 -0.1166 -0.1174 0.1538 0.1547 0.1359 0.1350 0.1490 0.1419 0.1428 0.1486 0.1294 0.1131 0.1263 0.1292 0.1238 0.1140 0.1135 0.1291 0.1235 0.1300 0.1266 0.1130
va: 2.3697 1.9883 1.9906 5.4858 5.4919 2.1269 2.1331 2.0950 2.1005 2.1024 2.0930 3.7460 3.7607 3.7528 3.7618 3.9360 3.9682 4.0012 3.9800 3.9949 3.9429 3.9717 4.0168 3.8438 3.8465 3.8475 3.8421 0.9890 0.9912 1.0145 1.0124 1.0014 1.0151 1.0127 1.0012 0.9908 0.9985 0.9891 0.9920 0.9856 0.9984 0.9987 0.9915 0.9859 0.9906 0.9894 0.9989
dispcorr: -0.022968290 hartree
energy: -2950.759015638059
dipole: 0.21559 -0.25081 -0.03522 8.46907 -7.46668 1.00239 4.12399 -2.73998 1.38401
magnitude: 1.70924 au
magnitude: 4.34455 debye
