program: Orca
programVersion: 5.0.2
elementType: S S S P P O O O O O O C C C C C C C C C C C C C C C C H H H H H H H H H H H H H H H H H H H H
charge: 0
multiplicity: 1
keywords: wb97x-d3
keywords: def2-TZVPP
keywords: def2/J RIJCOSX
keywords: DEFGRID2
keywords: scfconv7
keywords: smallprint printgap noloewdin
keywords: NOSOSCF
formula: C16H20O6P2S3
InChI: InChI=1/C16H20O6P2S3/c1-17-23(25,18-2)21-13-5-9-15(10-6-13)27-16-11-7-14(8-12-16)22-24(26,19-3)20-4/h5-12H,1-4H3
47 atoms
S  0.00799 -3.265833 -0.190428
S  -4.169727 2.12909 2.266632
S  4.391887 1.59781 -2.386689
P  -5.365063 1.106545 1.183558
P  5.540257 0.842439 -1.051939
O  -4.729784 0.251544 -0.032892
O  4.811905 0.169838 0.223881
O  -6.404688 2.011008 0.397119
O  -6.200787 -0.048135 1.907662
O  6.505814 -0.342075 -1.495138
O  6.558364 1.824453 -0.321851
C  -1.381073 -2.174931 -0.11372
C  1.394456 -2.17084 -0.074136
C  -3.618922 -0.54552 0.004191
C  3.678258 -0.606908 0.094921
C  -1.839036 -1.532478 -1.260545
C  1.290372 -0.802653 0.150684
C  -2.058135 -1.99934 1.085966
C  2.656241 -2.748454 -0.205968
C  -2.948424 -0.70866 -1.201047
C  2.432963 -0.019863 0.228694
C  -3.181836 -1.189197 1.153266
C  3.798207 -1.969831 -0.123938
C  -7.348274 1.476511 -0.545124
C  -6.904208 0.226658 3.124482
C  7.193037 -0.315236 -2.749846
C  6.146217 3.121946 0.119391
H  -1.325288 -1.666845 -2.203339
H  0.324965 -0.328494 0.263972
H  -1.714067 -2.498202 1.982282
H  2.75874 -3.813288 -0.3773
H  -3.303225 -0.201848 -2.089342
H  2.347164 1.044546 0.404699
H  -3.698605 -1.088001 2.097373
H  4.77361 -2.428801 -0.220213
H  -7.786767 0.539083 -0.20293
H  -6.872877 1.325156 -1.513494
H  -8.138567 2.216064 -0.647248
H  -7.478813 -0.665671 3.358284
H  -6.208103 0.430592 3.937388
H  -7.588023 1.068253 3.013112
H  7.734163 -1.254757 -2.826042
H  6.492071 -0.236301 -3.57966
H  7.903238 0.509968 -2.792503
H  5.318973 3.059838 0.827639
H  7.00453 3.567252 0.616711
H  5.855036 3.747333 -0.724694
elementType: S P O C H
totalener: -2950.73612059 hartree
nucrepener: 3268.83259781 hartree
electener: -6219.56871840 hartree
twoeener: 4349.92079345 hartree
cpcmener: -0.03286751 hartree
kineticenergy: 2942.56343551 hartree
xcener: -192.751479982898 hartree
chargesum: 0.0000000
charge: -0.054703 -0.418579 -0.450108 0.706591 0.764744 -0.310302 -0.355352 -0.335618 -0.329846 -0.339077 -0.336342 0.030802 0.080131 0.292412 0.222692 -0.113608 -0.165374 -0.134484 -0.169125 -0.201691 -0.195900 -0.172482 -0.162170 -0.114372 -0.114931 -0.117313 -0.114818 0.142991 0.142996 0.138162 0.130880 0.149509 0.146711 0.131987 0.151988 0.121102 0.120348 0.127890 0.129750 0.116942 0.127365 0.127241 0.112378 0.125502 0.124458 0.129183 0.111443
qa: -0.0547 -0.4186 -0.4501 0.7066 0.7647 -0.3103 -0.3554 -0.3356 -0.3298 -0.3391 -0.3363 0.0308 0.0801 0.2924 0.2227 -0.1136 -0.1654 -0.1345 -0.1691 -0.2017 -0.1959 -0.1725 -0.1622 -0.1144 -0.1149 -0.1173 -0.1148 0.1430 0.1430 0.1382 0.1309 0.1495 0.1467 0.1320 0.1520 0.1211 0.1203 0.1279 0.1298 0.1169 0.1274 0.1272 0.1124 0.1255 0.1245 0.1292 0.1114
va: 2.3532 2.0289 1.9872 5.5319 5.4979 2.1419 2.1003 2.1131 2.0493 2.1134 2.1018 3.7587 3.8361 3.7297 3.7270 3.9590 3.9157 4.0332 3.9524 3.9933 4.0502 3.9651 4.0483 3.8467 3.8305 3.8490 3.8467 1.0026 1.0018 1.0114 1.0085 1.0028 1.0039 1.0241 1.0045 0.9921 0.9907 0.9894 0.9913 1.0013 0.9879 0.9906 0.9996 0.9863 0.9856 0.9911 0.9995
dispcorr: -0.023307107 hartree
energy: -2950.759427695511
dipole: -3.88152 2.40287 -1.47865 1.54181 -2.00072 -0.45891 -0.75199 0.65364 -0.09834
magnitude: 1.55135 au
magnitude: 3.94322 debye
