program: Orca
programVersion: 5.0.2
elementType: S S S P P O O O O O O C C C C C C C C C C C C C C C C H H H H H H H H H H H H H H H H H H H H
charge: 0
multiplicity: 1
keywords: wb97x-d3
keywords: def2-TZVPP
keywords: def2/J RIJCOSX
keywords: DEFGRID2
keywords: scfconv7
keywords: smallprint printgap noloewdin
keywords: NOSOSCF
formula: C16H20O6P2S3
InChI: InChI=1/C16H20O6P2S3/c1-17-23(25,18-2)21-13-5-9-15(10-6-13)27-16-11-7-14(8-12-16)22-24(26,19-3)20-4/h5-12H,1-4H3
47 atoms
S  -0.016627 -3.337512 -0.443436
S  -6.57088 1.979855 1.785145
S  3.805971 2.347114 -0.249373
P  -5.416407 0.862806 0.748833
P  5.239294 1.136667 -0.640541
O  -4.122745 0.404129 1.598152
O  5.08298 -0.369056 -0.069421
O  -4.853736 1.478781 -0.612494
O  -5.965107 -0.544084 0.246306
O  5.544827 0.830101 -2.171387
O  6.683449 1.50999 -0.087133
C  -1.211186 -2.180268 0.163277
C  1.490785 -2.418574 -0.318404
C  -3.171547 -0.457145 1.083207
C  3.885673 -1.046231 -0.164389
C  -2.243375 -2.658464 0.963087
C  2.358111 -2.40521 -1.403596
C  -1.171078 -0.830671 -0.175131
C  1.842226 -1.756912 0.856014
C  -3.235516 -1.799881 1.411387
C  3.566237 -1.726531 -1.326338
C  -2.142353 0.036159 0.296007
C  3.030638 -1.052607 0.927733
C  -4.431848 2.843932 -0.6887
C  -7.189561 -0.634398 -0.49084
C  5.558933 1.872901 -3.151737
C  6.858311 2.080124 1.214266
H  -2.278232 -3.702422 1.247562
H  2.093461 -2.913536 -2.321891
H  -0.378792 -0.442846 -0.802234
H  1.182891 -1.773978 1.714198
H  -4.036073 -2.173133 2.036808
H  4.242328 -1.72522 -2.171175
H  -2.088318 1.089183 0.051924
H  3.299781 -0.525104 1.833558
H  -3.642181 3.06251 0.031466
H  -5.270285 3.520041 -0.51922
H  -4.046232 2.993974 -1.694461
H  -7.423068 -1.692133 -0.580651
H  -8.003374 -0.132255 0.033577
H  -7.079075 -0.205103 -1.486806
H  6.341067 2.602878 -2.941189
H  5.764704 1.396285 -4.106914
H  4.59403 2.377376 -3.202629
H  7.917715 2.302407 1.315412
H  6.285978 3.001952 1.319866
H  6.563571 1.378114 1.99508
elementType: S P O C H
totalener: -2950.73660516 hartree
nucrepener: 3303.14047053 hartree
electener: -6253.87707569 hartree
twoeener: 4383.66322320 hartree
cpcmener: -0.03219662 hartree
kineticenergy: 2942.57069601 hartree
xcener: -192.749481526905 hartree
chargesum: 0.0000000
charge: -0.040482 -0.432994 -0.448729 0.719953 0.766886 -0.345049 -0.351656 -0.333053 -0.322354 -0.337286 -0.336972 0.041842 0.037013 0.243188 0.241737 -0.140332 -0.146508 -0.163299 -0.135499 -0.184583 -0.167573 -0.171123 -0.187832 -0.120718 -0.109855 -0.117138 -0.114724 0.135917 0.136547 0.151917 0.153522 0.148384 0.153927 0.160542 0.150344 0.123910 0.120791 0.132961 0.126069 0.105605 0.124111 0.126388 0.127335 0.112239 0.129225 0.110637 0.126768
qa: -0.0405 -0.4330 -0.4487 0.7200 0.7669 -0.3450 -0.3517 -0.3331 -0.3224 -0.3373 -0.3370 0.0418 0.0370 0.2432 0.2417 -0.1403 -0.1465 -0.1633 -0.1355 -0.1846 -0.1676 -0.1711 -0.1878 -0.1207 -0.1099 -0.1171 -0.1147 0.1359 0.1365 0.1519 0.1535 0.1484 0.1539 0.1605 0.1503 0.1239 0.1208 0.1330 0.1261 0.1056 0.1241 0.1264 0.1273 0.1122 0.1292 0.1106 0.1268
va: 2.3568 2.0256 1.9886 5.5258 5.4930 2.1162 2.1048 2.0597 2.1044 2.1155 2.1044 3.7576 3.7352 3.7462 3.7274 3.9618 3.9952 3.9486 3.9152 4.0366 4.0482 4.0049 4.0060 3.8284 3.8454 3.8482 3.8411 1.0118 1.0135 0.9930 0.9904 1.0021 1.0053 0.9876 1.0014 0.9841 1.0049 0.9896 0.9890 1.0013 0.9893 0.9864 0.9907 0.9992 0.9908 1.0011 0.9853
dispcorr: -0.023680092 hartree
energy: -2950.760285250498
dipole: 4.32247 -2.79655 1.52591 5.80978 -5.57451 0.23527 -7.98678 6.34554 -1.64124
magnitude: 2.25332 au
magnitude: 5.72747 debye
