program: Orca
programVersion: 5.0.2
elementType: S S S P P O O O O O O C C C C C C C C C C C C C C C C H H H H H H H H H H H H H H H H H H H H
charge: 0
multiplicity: 1
keywords: wb97x-d3
keywords: def2-TZVPP
keywords: def2/J RIJCOSX
keywords: DEFGRID2
keywords: scfconv7
keywords: smallprint printgap noloewdin
keywords: NOSOSCF
formula: C16H20O6P2S3
InChI: InChI=1/C16H20O6P2S3/c1-17-23(25,18-2)21-13-5-9-15(10-6-13)27-16-11-7-14(8-12-16)22-24(26,19-3)20-4/h5-12H,1-4H3
47 atoms
S  -0.025459 -3.591312 -0.457919
S  -3.482706 2.059899 0.960682
S  6.450685 2.177706 0.548427
P  -5.068439 1.040869 0.624432
P  5.168627 1.038405 -0.300549
O  -4.891106 -0.245035 -0.341617
O  4.579577 -0.060394 0.725727
O  -6.278423 1.785223 -0.092853
O  -5.794363 0.363689 1.86868
O  3.904775 1.749052 -0.967758
O  5.65989 0.099899 -1.488811
C  -1.45186 -2.545932 -0.398726
C  1.302564 -2.469552 -0.123117
C  -3.739932 -0.999863 -0.338543
C  3.493008 -0.857443 0.411626
C  -1.630095 -1.5279 -1.332203
C  1.142362 -1.288698 0.59476
C  -2.430322 -2.7865 0.557376
C  2.572115 -2.840004 -0.55825
C  -2.766999 -0.740866 -1.292747
C  2.235694 -0.476814 0.849271
C  -3.584364 -2.016574 0.586521
C  3.671147 -2.041302 -0.284476
C  -6.039576 2.728254 -1.14316
C  -5.932519 1.070172 3.107457
C  3.292501 2.899122 -0.379208
C  6.268755 0.649962 -2.661159
H  -0.876628 -1.339119 -2.08551
H  0.169491 -0.987444 0.9594
H  -2.295562 -3.572422 1.288434
H  2.714258 -3.754167 -1.121616
H  -2.906043 0.057737 -2.009411
H  2.107973 0.442241 1.407249
H  -4.3509 -2.210425 1.325188
H  4.654504 -2.347822 -0.614447
H  -7.015213 3.05351 -1.495059
H  -5.495506 2.274937 -1.972409
H  -5.484787 3.590591 -0.774153
H  -4.957758 1.324568 3.523678
H  -6.522762 1.978638 2.983906
H  -6.449777 0.400386 3.789464
H  2.413192 3.12242 -0.978195
H  2.983502 2.712676 0.648502
H  3.969756 3.751454 -0.402156
H  6.697242 -0.182905 -3.212326
H  5.529482 1.150267 -3.285807
H  7.062272 1.352208 -2.403823
elementType: S P O C H
totalener: -2950.73620765 hartree
nucrepener: 3327.73242406 hartree
electener: -6278.46863172 hartree
twoeener: 4408.01331006 hartree
cpcmener: -0.03230588 hartree
kineticenergy: 2942.57880158 hartree
xcener: -192.751205976184 hartree
chargesum: -0.0000000
charge: -0.042841 -0.445862 -0.431527 0.765144 0.713014 -0.352502 -0.344044 -0.336860 -0.339067 -0.333355 -0.326402 0.047817 0.059725 0.242824 0.226195 -0.144358 -0.161196 -0.135366 -0.161783 -0.169238 -0.195523 -0.167030 -0.158235 -0.115123 -0.118604 -0.113363 -0.105350 0.150621 0.144138 0.137039 0.133361 0.151183 0.160308 0.153436 0.149605 0.129549 0.124157 0.113746 0.113598 0.125886 0.128474 0.132226 0.120872 0.121406 0.125532 0.123027 0.104746
qa: -0.0428 -0.4459 -0.4315 0.7651 0.7130 -0.3525 -0.3440 -0.3369 -0.3391 -0.3334 -0.3264 0.0478 0.0597 0.2428 0.2262 -0.1444 -0.1612 -0.1354 -0.1618 -0.1692 -0.1955 -0.1670 -0.1582 -0.1151 -0.1186 -0.1134 -0.1054 0.1506 0.1441 0.1370 0.1334 0.1512 0.1603 0.1534 0.1496 0.1295 0.1242 0.1137 0.1136 0.1259 0.1285 0.1322 0.1209 0.1214 0.1255 0.1230 0.1047
va: 2.3604 1.9874 2.0252 5.4878 5.5289 2.1031 2.1162 2.1019 2.1116 2.0500 2.1035 3.7294 3.8019 3.7226 3.7389 3.9532 3.9214 4.0002 3.9570 3.9912 4.0236 4.0444 4.0260 3.8459 3.8479 3.8277 3.8435 0.9951 1.0002 1.0134 1.0111 0.9978 0.9910 1.0049 1.0048 0.9918 0.9847 0.9988 0.9986 0.9864 0.9912 0.9911 0.9858 1.0040 0.9892 0.9904 1.0025
dispcorr: -0.023903426 hartree
energy: -2950.760111078548
dipole: -7.80823 5.41115 -2.39708 8.47115 -7.75103 0.72013 -4.68481 3.48172 -1.20309
magnitude: 2.77705 au
magnitude: 7.05870 debye
