program: Orca
programVersion: 5.0.2
elementType: S S S P P O O O O O O C C C C C C C C C C C C C C C C H H H H H H H H H H H H H H H H H H H H
charge: 0
multiplicity: 1
keywords: wb97x-d3
keywords: def2-TZVPP
keywords: def2/J RIJCOSX
keywords: DEFGRID2
keywords: scfconv7
keywords: smallprint printgap noloewdin
keywords: NOSOSCF
formula: C16H20O6P2S3
InChI: InChI=1/C16H20O6P2S3/c1-17-23(25,18-2)21-13-5-9-15(10-6-13)27-16-11-7-14(8-12-16)22-24(26,19-3)20-4/h5-12H,1-4H3
47 atoms
S  0.019694 -2.468995 1.087816
S  -5.419762 1.526567 2.154792
S  6.667675 -1.143264 -0.426775
P  -6.095339 0.714605 0.560518
P  6.040306 0.64299 -0.710187
O  -4.970801 0.269124 -0.527101
O  4.46158 0.810454 -1.018629
O  -7.055879 1.564269 -0.382817
O  -6.957572 -0.585943 0.850013
O  6.207269 1.685892 0.479978
O  6.656635 1.451245 -1.93474
C  -1.435161 -1.604194 0.567513
C  1.327256 -1.457254 0.456368
C  -3.805885 -0.355913 -0.13696
C  3.459068 0.034893 -0.493742
C  -2.574146 -2.3590 0.303739
C  1.438116 -1.184433 -0.905072
C  -1.494556 -0.21626 0.476304
C  2.295494 -0.982559 1.33197
C  -3.766174 -1.735929 -0.034649
C  2.497096 -0.432092 -1.379518
C  -2.676927 0.407802 0.115394
C  3.370818 -0.242243 0.860759
C  -6.69128 2.873206 -0.831909
C  -7.634126 -1.314694 -0.186262
C  7.435801 1.793138 1.207452
C  6.857544 0.832753 -3.209338
H  -2.539905 -3.440092 0.355603
H  0.696311 -1.555299 -1.600625
H  -0.623308 0.389381 0.688664
H  2.216772 -1.180814 2.392968
H  -4.646844 -2.330276 -0.243552
H  2.581695 -0.212853 -2.436267
H  -2.719332 1.486081 0.035368
H  4.105092 0.133066 1.561338
H  -7.56732 3.291413 -1.321283
H  -5.869158 2.827746 -1.546762
H  -6.409942 3.512432 0.005839
H  -7.043015 -1.384622 -1.099375
H  -7.803477 -2.317424 0.198354
H  -8.593616 -0.850347 -0.410535
H  7.252436 2.485533 2.02525
H  7.738297 0.828332 1.615606
H  8.232309 2.187275 0.575675
H  7.532579 -0.019631 -3.1306
H  5.911922 0.508879 -3.64549
H  7.305646 1.586392 -3.852073
elementType: S P O C H
totalener: -2950.73646925 hartree
nucrepener: 3238.82497682 hartree
electener: -6189.56144607 hartree
twoeener: 4319.54345745 hartree
cpcmener: -0.03437078 hartree
kineticenergy: 2942.54443937 hartree
xcener: -192.746707642029 hartree
chargesum: 0.0000000
charge: -0.042019 -0.427905 -0.442149 0.729473 0.754029 -0.357841 -0.328191 -0.329714 -0.341404 -0.336675 -0.338635 0.047198 0.034392 0.241031 0.233761 -0.161252 -0.139973 -0.145402 -0.144456 -0.162302 -0.172958 -0.186628 -0.156919 -0.108408 -0.127983 -0.115073 -0.116469 0.133701 0.152216 0.153610 0.136157 0.156926 0.150023 0.143815 0.145178 0.128481 0.124811 0.105718 0.120015 0.130618 0.128490 0.129126 0.109744 0.128677 0.110931 0.124990 0.129246
qa: -0.0420 -0.4279 -0.4421 0.7295 0.7540 -0.3578 -0.3282 -0.3297 -0.3414 -0.3367 -0.3386 0.0472 0.0344 0.2410 0.2338 -0.1613 -0.1400 -0.1454 -0.1445 -0.1623 -0.1730 -0.1866 -0.1569 -0.1084 -0.1280 -0.1151 -0.1165 0.1337 0.1522 0.1536 0.1362 0.1569 0.1500 0.1438 0.1452 0.1285 0.1248 0.1057 0.1200 0.1306 0.1285 0.1291 0.1097 0.1287 0.1109 0.1250 0.1292
va: 2.3567 2.0233 1.9915 5.5153 5.4928 2.0505 2.1295 2.0904 2.1099 2.0981 2.1074 3.7724 3.7382 3.7290 3.7663 3.9873 3.9467 3.9129 4.0214 4.0400 3.9883 4.0398 3.9667 3.8393 3.8447 3.8378 3.8474 1.0135 0.9926 0.9889 1.0153 0.9891 1.0002 1.0056 1.0115 0.9891 0.9889 1.0021 0.9907 0.9882 0.9933 0.9897 1.0014 0.9890 0.9999 0.9852 0.9906
dispcorr: -0.023538256 hartree
energy: -2950.760007507650
dipole: -0.07142 0.09160 0.02018 4.75981 -3.94281 0.81700 -9.67824 7.18876 -2.48948
magnitude: 2.62019 au
magnitude: 6.65999 debye
