program: Orca
programVersion: 5.0.2
elementType: S S S P P O O O O O O C C C C C C C C C C C C C C C C H H H H H H H H H H H H H H H H H H H H
charge: 0
multiplicity: 1
keywords: wb97x-d3
keywords: def2-TZVPP
keywords: def2/J RIJCOSX
keywords: DEFGRID2
keywords: scfconv7
keywords: smallprint printgap noloewdin
keywords: NOSOSCF
formula: C16H20O6P2S3
InChI: InChI=1/C16H20O6P2S3/c1-17-23(25,18-2)21-13-5-9-15(10-6-13)27-16-11-7-14(8-12-16)22-24(26,19-3)20-4/h5-12H,1-4H3
47 atoms
S  0.047299 -2.990911 0.601683
S  -5.565336 0.877399 2.397462
S  6.518401 -0.992276 -0.726294
P  -5.737126 1.01211 0.495048
P  5.796215 0.779209 -0.658572
O  -5.062981 -0.172983 -0.370345
O  4.207661 0.913422 -0.937248
O  -5.105737 2.285651 -0.222505
O  -7.208451 1.004963 -0.111102
O  5.915416 1.575884 0.713855
O  6.360544 1.845427 -1.696975
C  -1.447071 -2.085046 0.314228
C  1.287662 -1.814566 0.144331
C  -3.857039 -0.771158 -0.094416
C  3.272806 -0.014521 -0.549247
C  -1.526406 -0.703681 0.453071
C  2.186436 -1.362344 1.10133
C  -2.590652 -2.803627 -0.021963
C  1.395184 -1.364725 -1.168972
C  -2.72359 -0.042019 0.234466
C  3.186649 -0.463946 0.758386
C  -3.797706 -2.150131 -0.210007
C  2.382375 -0.460276 -1.51609
C  -5.298085 3.600168 0.313871
C  -8.228447 0.154042 0.422386
C  7.122031 1.533389 1.485481
C  6.598636 1.489209 -3.06342
H  -0.653507 -0.123857 0.722605
H  2.105995 -1.699353 2.126414
H  -2.548636 -3.878797 -0.144595
H  0.707161 -1.718131 -1.926036
H  -2.749125 1.036534 0.315828
H  3.865884 -0.107308 1.521362
H  -4.685323 -2.712283 -0.47078
H  2.46694 -0.106297 -2.535451
H  -4.873311 3.681071 1.314518
H  -6.355103 3.865688 0.34462
H  -4.779353 4.284874 -0.352151
H  -8.456627 0.417885 1.454825
H  -9.112034 0.309284 -0.191224
H  -7.939541 -0.896238 0.370673
H  7.361005 0.512196 1.782595
H  7.961003 1.957162 0.932805
H  6.941405 2.132713 2.373772
H  5.685569 1.14535 -3.550327
H  6.949085 2.389768 -3.561117
H  7.363206 0.715838 -3.137649
elementType: S P O C H
totalener: -2950.73641403 hartree
nucrepener: 3250.20139211 hartree
electener: -6200.93780615 hartree
twoeener: 4331.09349421 hartree
cpcmener: -0.03179260 hartree
kineticenergy: 2942.57027271 hartree
xcener: -192.752340457152 hartree
chargesum: -0.0000000
charge: -0.051076 -0.443073 -0.441907 0.751932 0.756259 -0.326138 -0.331700 -0.339069 -0.339798 -0.339325 -0.338530 0.048643 0.046121 0.215795 0.227947 -0.172916 -0.144564 -0.149303 -0.138742 -0.156841 -0.157337 -0.178151 -0.168824 -0.117233 -0.116619 -0.117849 -0.117435 0.151453 0.136965 0.133297 0.148757 0.144473 0.150041 0.148222 0.150839 0.112449 0.127983 0.129951 0.113001 0.129087 0.124418 0.113040 0.129410 0.129358 0.124940 0.129579 0.112471
qa: -0.0511 -0.4431 -0.4419 0.7519 0.7563 -0.3261 -0.3317 -0.3391 -0.3398 -0.3393 -0.3385 0.0486 0.0461 0.2158 0.2279 -0.1729 -0.1446 -0.1493 -0.1387 -0.1568 -0.1573 -0.1782 -0.1688 -0.1172 -0.1166 -0.1178 -0.1174 0.1515 0.1370 0.1333 0.1488 0.1445 0.1500 0.1482 0.1508 0.1124 0.1280 0.1300 0.1130 0.1291 0.1244 0.1130 0.1294 0.1294 0.1249 0.1296 0.1125
va: 2.3378 1.9896 1.9899 5.4920 5.4872 2.1329 2.1256 2.0928 2.1027 2.0956 2.1059 3.7878 3.7216 3.7655 3.7697 3.9557 4.0216 3.9667 3.9534 3.9556 3.9672 4.0142 3.9908 3.8391 3.8454 3.8383 3.8468 0.9930 1.0149 1.0110 0.9962 1.0140 1.0080 1.0014 0.9992 0.9998 0.9896 0.9905 0.9992 0.9915 0.9857 0.9995 0.9886 0.9910 0.9852 0.9910 0.9991
dispcorr: -0.023012391 hartree
energy: -2950.759426425151
dipole: -0.58985 0.46611 -0.12374 9.14026 -7.43989 1.70036 -2.63988 1.73211 -0.90777
magnitude: 1.93147 au
magnitude: 4.90941 debye
