program: Gaussian 09
title: 000066656
version: EM64L-G09RevD.01
frameworkgroup: C1[X(C10H9ClN2O)]
method: RPBEPBE
basis: SDD
operation: Freq
keyword: #p
keyword: freq=noraman
keyword: PBEPBE/SDD
title: #p freq=noraman PBEPBE/SDD
converged: YES YES NO NO
title: Mulliken charges:
elementType: Cl O N N C C C C C C C C C C H H H H H H H H H
charge: -0.069198 -0.225316 -0.288851 -0.038288 -0.645315 0.238424 0.184953 0.442012 -0.753602 -0.348692 -0.365733 -0.059977 -0.198254 -0.260567 0.278501 0.278595 0.236716 0.257574 0.236624 0.305157 0.304886 0.232947 0.257403
chargesum: 0.00000
title: Mulliken charges with hydrogens summed into heavy atoms:
elementType: Cl O N N C C C C C C C C C C
charge: -0.069198 -0.225316 -0.288851 -0.038288 -0.088219 0.238424 0.184953 0.442012 -0.022688 -0.043535 -0.060847 -0.059977 0.034692 -0.003165
polarizability: 2.03372514e+02 -2.56890453e+00 1.48868827e+02 6.26359584e-02 -6.50004063e-02 5.99415278e+01
1716.lowfreq: -5.7128 -3.8850 0.0016 0.0021 0.0030 7.0022 38.6148 81.4623 108.2819
frequency: 38.6120 81.4606 108.2819 138.2154 143.8903 182.6227 221.5813 232.2532 271.3829 349.3916 353.8040 369.1387 407.7137 441.7340 446.8555 547.9152 552.1185 573.5407 600.4720 646.5363 690.4372 716.6856 772.3989 790.0319 892.4245 892.5293 905.9352 913.4716 963.2440 979.9772 989.6038 990.6182 1031.0893 1038.5499 1073.0327 1099.9200 1125.0502 1148.1578 1181.3289 1193.3335 1281.8907 1310.6472 1360.5991 1379.3927 1402.9967 1405.0191 1437.7534 1453.2817 1458.2058 1472.9500 1569.6965 1587.6425 1607.2108 1642.4102 2980.4183 3018.2457 3055.1957 3071.3484 3111.4479 3147.9820 3179.3452 3194.7070 3199.9225
redmass: 6.4844 3.8213 6.3973 2.5488 1.1741 5.4477 8.3635 3.9216 4.4668 4.0054 5.2235 5.6045 8.4876 2.5435 2.8547 4.9034 4.8283 5.5264 5.3996 7.0774 2.4135 8.6824 5.8728 1.3680 2.6890 2.2132 1.3671 1.4298 6.3279 5.7118 1.3154 2.1597 1.5015 4.6118 2.0045 1.5889 1.2741 4.7009 1.1026 1.5322 1.5302 2.8915 3.0918 7.8584 1.4634 1.1073 2.9424 1.1253 1.0461 2.8611 6.4998 6.1131 6.6242 12.1296 1.0379 1.0619 1.0971 1.0995 1.0984 1.0887 1.0951 1.0956 1.0928
irintensity: 0.9712 4.6391 2.0031 5.0566 1.2132 0.0830 1.2341 2.1481 0.4524 2.8994 6.7594 0.7650 11.0865 3.0555 3.0933 0.0515 9.7083 13.5420 0.2489 4.1531 24.8359 55.3804 7.0073 60.6349 10.7466 6.0706 12.5542 16.8800 19.6562 6.0818 3.2220 13.4983 7.1721 41.7109 24.4896 15.9211 0.1132 90.9070 2.7438 18.1001 12.8933 107.1525 26.2233 1.5096 19.5312 42.7509 29.4141 10.7325 18.9424 193.9393 37.2625 16.2855 160.9887 258.7677 23.3836 0.5050 12.9764 1.1772 8.0545 10.5692 3.1369 5.7057 3.4394
temp: 298.150 k
press: 1.00000 atm
elementType: 17 8 7 7 6 6 6 6 6 6 6 6 6 6 1 1 1 1 1 1 1 1 1
symmnumber: 1
zpe: 445152.3 jmol-1
zpe.correction: 0.169550 hartree
zpe.thermalcorrener: 0.181934 hartree
zpe.thermalcorrenthalpy: 0.182879 hartree
zpe.thermalcorrgfe: 0.130033 hartree
zpe.sumelectzpe: -1030.244004 hartree
zpe.sumelectthermal: -1030.231619 hartree
zpe.sumelectthermalent: -1030.230675 hartree
zpe.sumelectthermalfe: -1030.283520 hartree
dipole: 4.0121 -1.3251 -0.0090
dipole: 4.2252
quadrupole: -72.8264 -91.2723 -89.6202
quadrupole: -16.6932 -0.0039 -0.0791
quadrupole: 11.7465 -6.6994 -5.0472 -16.6932 -0.0039 -0.0791
hfenergy: -1030.4135532 hartree
pointgroup: C01 [X(C10H9Cl1N2O1)]
dipole: 1.639118 0.2748101 -0.0334614 debye
dipolederiv: -0.3926596 0.293948 0.0071308 0.4066952 -0.6209653 -0.0091645 0.0068689 -0.0064389 -0.0809066 -0.4464968 -0.0926515 0.0017213 0.2581703 -1.2490194 -0.0128233 0.0047927 -0.0034214 -0.3365885 -1.2734248 0.4517753 0.0321048 -0.1545096 -0.952131 -0.0011377 0.0294514 -0.0172493 -0.0700504 -0.2092824 0.1645083 0.0027227 0.6939594 0.2156967 -0.0142116 0.0038761 -0.0020746 -0.1418146 -0.4321028 -0.1666962 0.0132324 -0.0979856 -0.2679569 -0.0004301 0.0126189 0.0015797 0.1487816 0.2466574 0.019847 -0.0070059 0.0123721 0.4444873 0.0028421 -0.0059101 0.0033341 -0.0320336 0.8757516 -0.3126204 -0.019489 -0.5879538 1.5355356 0.0238087 -0.0196034 0.0167139 0.1759948 1.4429009 -0.0049503 -0.032133 0.0016729 0.1034729 -0.0017205 -0.0324945 -0.0008953 0.096621 -0.1360605 -0.114249 0.0037883 -0.0613664 -0.089154 0.0005498 0.0034327 0.0012695 0.0549875 -0.4635052 0.146484 0.0080884 0.3146636 -0.2345352 -0.0072634 0.0087167 -0.0029909 -0.1387994 -0.4056309 -0.023474 0.0056232 -0.1879433 -0.1112801 0.0041645 0.0044448 0.0005707 -0.1733893 0.6223604 -0.4380767 -0.0158225 -0.6431945 0.9593134 0.0143619 -0.015327 0.0095386 -0.0551094 0.2278506 -0.0285333 -0.0083326 0.0394711 0.1470459 -0.0011294 -0.0087873 0.0012612 -0.1394562 -0.2138143 0.1039237 0.0020273 0.1653659 -0.3459284 -0.0035104 0.0017465 -0.0022742 -0.1355179 0.0981795 -0.0054315 0.057254 0.001275 0.1090898 -0.0070202 0.0905519 -0.0335737 0.0299892 0.0905474 -0.0029726 -0.0602801 0.002598 0.1085247 0.0079375 -0.0935263 0.0346968 0.0382411 -0.0040454 -0.0325961 -0.0969419 -0.0377777 0.0702238 0.0446919 -0.139326 -0.0075517 -0.0219442 0.0644818 0.1175493 0.0019131 0.0185118 -0.0511697 -0.0012497 0.0015659 -0.0035287 0.1226161 0.0069821 -0.0328611 0.0953737 -0.0409604 0.0706254 -0.0419208 0.1377737 0.0101235 -0.0329873 0.1729419 -0.0339371 0.0003079 -0.0528774 0.0532065 0.0015107 0.0006127 0.0010331 0.1770472 0.1599371 0.0590586 0.0003023 0.0253919 0.0680026 -0.0002251 -0.0000347 -0.0015184 0.18414 0.0218935 -0.0630916 0.0031276 -0.0830936 -0.0692212 0.0020689 0.0032052 0.0014189 0.1550257 -0.0534617 -0.0049526 0.0052873 0.0075152 0.1061364 -0.0001293 0.0053511 -0.0000229 0.1751531 unknown
polarizability: 202.8020463|-5.7497538|149.3596201|-3.3692203|0.2961394|60.0212031 unknown
InChI: InChI=1S/C10H9ClN2O/c1-7-5-10(14)13(12-7)9-4-2-3-8(11)6-9/h2-4,6H,5H2,1H3
charge 0 multiplicity 1
23 atoms
Cl -3.62158 2.406263 0.166285
O  1.585365 -2.533011 0.029813
N  0.883938 -0.240814 0.062482
N  1.508201 1.056694 0.056152
C  3.192598 -0.597078 0.002673
C  2.815455 0.867563 0.021571
C  1.825998 -1.298145 0.031476
C  -0.539817 -0.30234 0.096181
C  3.770376 2.02192 0.005641
C  -1.274739 0.912868 0.112248
C  -1.214237 -1.552734 0.113205
C  -2.675471 0.841632 0.145424
C  -2.624078 -1.571801 0.145709
C  -3.379961 -0.376934 0.162625
H  3.757864 -0.887203 -0.901609
H  3.802169 -0.899365 0.873524
H  4.447985 1.988057 0.879676
H  3.218546 2.975253 0.023128
H  4.407945 1.997128 -0.898289
H  -0.748263 1.868239 0.098703
H  -0.640526 -2.480989 0.100842
H  -3.145026 -2.534877 0.157896
H  -4.472543 -0.393527 0.187746
