program: Orca
programVersion: 5.0.2
elementType: S S S P P O O O O O O C C C C C C C C C C C C C C C C H H H H H H H H H H H H H H H H H H H H
charge: 0
multiplicity: 1
keywords: wb97x-d3
keywords: def2-TZVPP
keywords: def2/J RIJCOSX
keywords: DEFGRID2
keywords: scfconv7
keywords: smallprint printgap noloewdin
keywords: NOSOSCF
formula: C16H20O6P2S3
InChI: InChI=1/C16H20O6P2S3/c1-17-23(25,18-2)21-13-5-9-15(10-6-13)27-16-11-7-14(8-12-16)22-24(26,19-3)20-4/h5-12H,1-4H3
47 atoms
S  0.110464 -3.011628 0.216879
S  -6.538857 -0.861179 0.683584
S  5.397936 0.955739 2.067928
P  -5.82582 0.713881 -0.139298
P  5.647765 1.194977 0.187632
O  -4.242999 0.979548 0.060342
O  5.122028 -0.021412 -0.753322
O  -6.405319 2.117856 0.334648
O  -5.934291 0.835676 -1.722116
O  4.946807 2.50577 -0.368188
O  7.132648 1.340294 -0.369467
C  -1.180616 -1.803754 0.156606
C  1.567335 -2.044847 -0.059825
C  -3.266086 0.017381 0.074186
C  3.935972 -0.676848 -0.505021
C  -1.253312 -0.781511 1.099984
C  2.769479 -2.54034 0.439358
C  -2.16453 -1.909547 -0.81751
C  1.565106 -0.861754 -0.791677
C  -2.288896 0.133698 1.0544
C  3.955085 -1.860497 0.213499
C  -3.215881 -1.004548 -0.860452
C  2.746999 -0.169155 -1.002738
C  -6.700465 2.374729 1.711589
C  -7.148827 0.505285 -2.405337
C  5.069773 2.927881 -1.73575
C  8.133409 0.360664 -0.073251
H  -0.494927 -0.68886 1.867057
H  2.78807 -3.454386 1.019974
H  -2.115654 -2.69756 -1.557698
H  0.645263 -0.466893 -1.202383
H  -2.343986 0.933953 1.781451
H  4.887241 -2.248912 0.602527
H  -3.961948 -1.096718 -1.638692
H  2.737313 0.751418 -1.572943
H  -7.077564 3.393125 1.76134
H  -5.806685 2.294311 2.331081
H  -7.463111 1.690249 2.082999
H  -7.449772 -0.521837 -2.197208
H  -7.955042 1.184379 -2.126468
H  -6.944339 0.610262 -3.467888
H  6.014219 3.448412 -1.889621
H  4.996977 2.094289 -2.434393
H  4.248464 3.614739 -1.923681
H  8.20896 0.186031 1.000791
H  7.9221 -0.5816 -0.579914
H  9.078016 0.757245 -0.43658
elementType: S P O C H
totalener: -2950.73687379 hartree
nucrepener: 3261.16937581 hartree
electener: -6211.90624960 hartree
twoeener: 4341.86014820 hartree
cpcmener: -0.03385505 hartree
kineticenergy: 2942.54948601 hartree
xcener: -192.747746439030 hartree
chargesum: -0.0000000
charge: -0.045975 -0.440908 -0.426992 0.752895 0.727586 -0.324630 -0.357206 -0.339104 -0.337397 -0.341820 -0.331188 0.038512 0.060569 0.236237 0.230776 -0.138107 -0.150528 -0.143193 -0.170757 -0.169571 -0.171785 -0.160080 -0.166535 -0.116532 -0.117351 -0.127407 -0.108005 0.150774 0.132728 0.136416 0.149271 0.149477 0.142889 0.145183 0.156957 0.129002 0.125783 0.112163 0.111243 0.129779 0.129392 0.128315 0.120605 0.130281 0.105148 0.124440 0.128650
qa: -0.0460 -0.4409 -0.4270 0.7529 0.7276 -0.3246 -0.3572 -0.3391 -0.3374 -0.3418 -0.3312 0.0385 0.0606 0.2362 0.2308 -0.1381 -0.1505 -0.1432 -0.1708 -0.1696 -0.1718 -0.1601 -0.1665 -0.1165 -0.1174 -0.1274 -0.1080 0.1508 0.1327 0.1364 0.1493 0.1495 0.1429 0.1452 0.1570 0.1290 0.1258 0.1122 0.1112 0.1298 0.1294 0.1283 0.1206 0.1303 0.1051 0.1244 0.1287
va: 2.3546 1.9918 2.0258 5.4909 5.5158 2.1355 2.0507 2.1060 2.0948 2.1060 2.0894 3.7405 3.7824 3.7702 3.7265 3.9546 3.9582 4.0282 3.9454 3.9828 4.0449 3.9633 4.0309 3.8447 3.8375 3.8434 3.8408 0.9945 1.0111 1.0153 0.9944 1.0009 1.0023 1.0120 0.9906 0.9911 0.9853 0.9995 1.0008 0.9888 0.9902 0.9937 0.9907 0.9885 1.0022 0.9893 0.9892
dispcorr: -0.023618349 hartree
energy: -2950.760492140947
dipole: 0.05932 -0.07221 -0.01289 6.72905 -5.59581 1.13324 -8.25211 6.04816 -2.20395
magnitude: 2.47827 au
magnitude: 6.29926 debye
