program: Orca
programVersion: 5.0.2
elementType: S S S P P O O O O O O C C C C C C C C C C C C C C C C H H H H H H H H H H H H H H H H H H H H
charge: 0
multiplicity: 1
keywords: wb97x-d3
keywords: def2-TZVPP
keywords: def2/J RIJCOSX
keywords: DEFGRID2
keywords: scfconv7
keywords: smallprint printgap noloewdin
keywords: NOSOSCF
formula: C16H20O6P2S3
InChI: InChI=1/C16H20O6P2S3/c1-17-23(25,18-2)21-13-5-9-15(10-6-13)27-16-11-7-14(8-12-16)22-24(26,19-3)20-4/h5-12H,1-4H3
47 atoms
S  0.107377 -2.990753 0.232085
S  -6.545581 -0.883385 0.671692
S  5.422385 0.961364 2.058865
P  -5.84125 0.701122 -0.140233
P  5.667301 1.198691 0.17781
O  -4.262793 0.981155 0.07406
O  5.120306 -0.010494 -0.75984
O  -6.436878 2.098306 0.332648
O  -5.940996 0.825924 -1.724014
O  4.982708 2.519223 -0.375681
O  7.150841 1.325269 -0.387873
C  -1.18709 -1.785404 0.168768
C  1.563246 -2.021411 -0.046517
C  -3.280054 0.024872 0.088307
C  3.932926 -0.659319 -0.500468
C  -1.284684 -0.787445 1.135443
C  2.767509 -2.525645 0.438949
C  -2.14906 -1.872494 -0.829173
C  1.558162 -0.829705 -0.76406
C  -2.325925 0.121711 1.09291
C  3.953733 -1.848903 0.208279
C  -3.20313 -0.971331 -0.872273
C  2.741343 -0.140389 -0.979937
C  -6.744076 2.348514 1.707217
C  -7.151299 0.494471 -2.412812
C  5.119552 2.947403 -1.738794
C  8.134381 0.323285 -0.111127
H  -0.546914 -0.717024 1.924563
H  2.786912 -3.445562 1.010207
H  -2.077521 -2.640114 -1.588621
H  0.63538 -0.42599 -1.159334
H  -2.40409 0.901455 1.839936
H  4.888566 -2.24409 0.583974
H  -3.932109 -1.041885 -1.668835
H  2.73188 0.785856 -1.540953
H  -7.128944 3.364053 1.758226
H  -5.854868 2.272468 2.3340
H  -7.504671 1.657598 2.07112
H  -7.961744 1.168762 -2.134233
H  -6.944505 0.604908 -3.474403
H  -7.450021 -0.534742 -2.211262
H  6.073463 3.45269 -1.885577
H  5.035636 2.119854 -2.443571
H  4.311515 3.649842 -1.926968
H  7.89947 -0.60973 -0.624379
H  9.083303 0.704035 -0.4801
H  8.217037 0.137117 0.960487
elementType: S P O C H
totalener: -2950.73696532 hartree
nucrepener: 3259.49982990 hartree
electener: -6210.23679522 hartree
twoeener: 4340.19047167 hartree
cpcmener: -0.03380798 hartree
kineticenergy: 2942.55074549 hartree
xcener: -192.747897094455 hartree
chargesum: 0.0000000
charge: -0.047779 -0.440727 -0.426238 0.753301 0.726930 -0.325149 -0.356968 -0.338728 -0.337686 -0.342014 -0.331009 0.038557 0.063506 0.234723 0.229776 -0.135670 -0.152029 -0.141694 -0.171784 -0.169660 -0.171393 -0.159641 -0.166495 -0.116291 -0.117403 -0.126975 -0.108115 0.149935 0.132609 0.136721 0.148732 0.149596 0.142925 0.146438 0.156634 0.128877 0.125565 0.112041 0.129602 0.129274 0.111177 0.127896 0.120687 0.129874 0.124386 0.128531 0.105156
qa: -0.0478 -0.4407 -0.4262 0.7533 0.7269 -0.3251 -0.3570 -0.3387 -0.3377 -0.3420 -0.3310 0.0386 0.0635 0.2347 0.2298 -0.1357 -0.1520 -0.1417 -0.1718 -0.1697 -0.1714 -0.1596 -0.1665 -0.1163 -0.1174 -0.1270 -0.1081 0.1499 0.1326 0.1367 0.1487 0.1496 0.1429 0.1464 0.1566 0.1289 0.1256 0.1120 0.1296 0.1293 0.1112 0.1279 0.1207 0.1299 0.1244 0.1285 0.1052
va: 2.3509 1.9922 2.0266 5.4899 5.5156 2.1344 2.0504 2.1060 2.0955 2.1053 2.0891 3.7398 3.7841 3.7707 3.7246 3.9557 3.9580 4.0264 3.9443 3.9853 4.0441 3.9634 4.0338 3.8449 3.8380 3.8436 3.8413 0.9955 1.0110 1.0150 0.9949 1.0007 1.0022 1.0116 0.9910 0.9911 0.9854 0.9995 0.9888 0.9903 1.0007 0.9937 0.9908 0.9888 0.9894 0.9893 1.0020
dispcorr: -0.023612206 hartree
energy: -2950.760577523657
dipole: 0.02097 -0.05931 -0.03835 6.64844 -5.52469 1.12375 -8.31659 6.11359 -2.20301
magnitude: 2.47336 au
magnitude: 6.28679 debye
