program: Orca
programVersion: 5.0.2
elementType: S S S P P O O O O O O C C C C C C C C C C C C C C C C H H H H H H H H H H H H H H H H H H H H
charge: 0
multiplicity: 1
keywords: wb97x-d3
keywords: def2-TZVPP
keywords: def2/J RIJCOSX
keywords: DEFGRID2
keywords: scfconv7
keywords: smallprint printgap noloewdin
keywords: NOSOSCF
formula: C16H20O6P2S3
InChI: InChI=1/C16H20O6P2S3/c1-17-23(25,18-2)21-13-5-9-15(10-6-13)27-16-11-7-14(8-12-16)22-24(26,19-3)20-4/h5-12H,1-4H3
47 atoms
S  0.09986 -3.061718 0.150479
S  -6.510384 -0.850907 0.73003
S  5.179777 1.146214 1.974699
P  -5.790322 0.735142 -0.065544
P  5.558042 1.217898 0.102076
O  -4.205528 0.987151 0.137343
O  5.14934 -0.111281 -0.74321
O  -6.363001 2.13259 0.433876
O  -5.899998 0.887396 -1.645408
O  4.843814 2.433003 -0.627941
O  7.072867 1.377882 -0.36185
C  -1.167121 -1.826359 0.121834
C  1.571661 -2.110751 -0.10406
C  -3.235351 0.017876 0.110645
C  3.954051 -0.759682 -0.518887
C  -1.198999 -0.805569 1.068796
C  2.745783 -2.559649 0.493583
C  -2.179211 -1.914457 -0.824662
C  1.603322 -0.982089 -0.917469
C  -2.226526 0.119771 1.059601
C  3.939801 -1.888017 0.282832
C  -3.220833 -0.997242 -0.832624
C  2.790743 -0.296511 -1.114034
C  -6.638296 2.374458 1.817506
C  -7.109137 0.56044 -2.339345
C  5.068704 2.752097 -2.009354
C  8.096948 0.515593 0.145559
H  -0.420554 -0.728303 1.816969
H  2.734753 -3.428198 1.140187
H  -2.160801 -2.697765 -1.571148
H  0.703141 -0.623885 -1.399721
H  -2.251494 0.915875 1.792772
H  4.851331 -2.23848 0.749335
H  -3.986917 -1.075498 -1.592432
H  2.807987 0.579891 -1.749713
H  -7.040702 3.382273 1.880672
H  -5.730259 2.31381 2.418055
H  -7.375315 1.668402 2.200199
H  -7.412624 -0.46722 -2.13834
H  -7.91668 1.238924 -2.063607
H  -6.896586 0.669649 -3.399773
H  5.985565 3.329756 -2.119917
H  5.121617 1.862837 -2.637399
H  4.224159 3.357305 -2.329099
H  7.985725 -0.496384 -0.244717
H  9.046357 0.925703 -0.189066
H  8.083947 0.487943 1.235788
elementType: S P O C H
totalener: -2950.73666399 hartree
nucrepener: 3266.59389567 hartree
electener: -6217.33055966 hartree
twoeener: 4347.37896404 hartree
cpcmener: -0.03376295 hartree
kineticenergy: 2942.55213051 hartree
xcener: -192.747664715421 hartree
chargesum: 0.0000000
charge: -0.050587 -0.441411 -0.428183 0.753199 0.729315 -0.323754 -0.355319 -0.338732 -0.337686 -0.341788 -0.331011 0.030275 0.054390 0.240758 0.226486 -0.124787 -0.148359 -0.147241 -0.167797 -0.177835 -0.173268 -0.159762 -0.160362 -0.116522 -0.116885 -0.129327 -0.109847 0.149787 0.133446 0.136254 0.151146 0.149404 0.144136 0.143605 0.159187 0.129041 0.126185 0.111216 0.110971 0.130310 0.129328 0.129218 0.122071 0.130557 0.125465 0.128436 0.106277
qa: -0.0506 -0.4414 -0.4282 0.7532 0.7293 -0.3238 -0.3553 -0.3387 -0.3377 -0.3418 -0.3310 0.0303 0.0544 0.2408 0.2265 -0.1248 -0.1484 -0.1472 -0.1678 -0.1778 -0.1733 -0.1598 -0.1604 -0.1165 -0.1169 -0.1293 -0.1098 0.1498 0.1334 0.1363 0.1511 0.1494 0.1441 0.1436 0.1592 0.1290 0.1262 0.1112 0.1110 0.1303 0.1293 0.1292 0.1221 0.1306 0.1255 0.1284 0.1063
va: 2.3407 1.9917 2.0248 5.4926 5.5128 2.1376 2.0520 2.1083 2.0935 2.1046 2.0911 3.7381 3.7658 3.7673 3.7321 3.9452 3.9647 4.0259 3.9490 3.9879 4.0485 3.9613 4.0162 3.8446 3.8361 3.8415 3.8400 0.9946 1.0122 1.0158 0.9925 1.0013 1.0015 1.0124 0.9891 0.9908 0.9854 0.9999 1.0012 0.9889 0.9901 0.9937 0.9908 0.9883 0.9887 0.9892 1.0021
dispcorr: -0.023617057 hartree
energy: -2950.760281045228
dipole: 0.69789 -0.46450 0.23339 6.48983 -5.43612 1.05371 -7.73175 5.64889 -2.08286
magnitude: 2.34586 au
magnitude: 5.96271 debye
