program: Orca
programVersion: 5.0.2
elementType: S S S P P O O O O O O C C C C C C C C C C C C C C C C H H H H H H H H H H H H H H H H H H H H
charge: 0
multiplicity: 1
keywords: wb97x-d3
keywords: def2-TZVPP
keywords: def2/J RIJCOSX
keywords: DEFGRID2
keywords: scfconv7
keywords: smallprint printgap noloewdin
keywords: NOSOSCF
formula: C16H20O6P2S3
InChI: InChI=1/C16H20O6P2S3/c1-17-23(25,18-2)21-13-5-9-15(10-6-13)27-16-11-7-14(8-12-16)22-24(26,19-3)20-4/h5-12H,1-4H3
47 atoms
S  -0.068987 -2.723872 -0.680077
S  -6.659771 -0.888611 0.291424
S  6.816215 -1.11186 -0.886611
P  -5.978236 0.900609 0.274888
P  6.063092 0.475568 -0.131206
O  -4.406269 1.074103 0.612858
O  4.775385 0.312153 0.830695
O  -6.607707 1.936098 1.307796
O  -6.058875 1.71073 -1.093396
O  7.067381 1.225323 0.844018
O  5.493926 1.559647 -1.15995
C  -1.370127 -1.585898 -0.296913
C  1.35878 -1.779185 -0.225438
C  -3.434675 0.163476 0.280175
C  3.654113 -0.390003 0.443927
C  -2.246423 -1.185884 -1.296681
C  1.463339 -0.421356 -0.514574
C  -1.541729 -1.111691 1.001266
C  2.41438 -2.434207 0.398777
C  -3.287307 -0.313442 -1.012117
C  2.607936 0.278231 -0.173046
C  -2.569316 -0.232835 1.289985
C  3.571937 -1.742954 0.723264
C  -7.008104 1.521855 2.619022
C  -7.261682 1.70416 -1.871911
C  6.695938 2.38868 1.599839
C  6.222221 1.902677 -2.343672
H  -2.115868 -1.54097 -2.310591
H  0.652129 0.101749 -1.004277
H  -0.872884 -1.425668 1.792253
H  2.338229 -3.485796 0.644544
H  -3.947336 0.005394 -1.808057
H  2.679698 1.337562 -0.382654
H  -2.703772 0.14109 2.297008
H  4.389714 -2.251127 1.216762
H  -7.805897 0.781031 2.567995
H  -7.376048 2.411096 3.12451
H  -6.168604 1.113057 3.182323
H  -7.516447 0.693072 -2.190214
H  -8.0966 2.131062 -1.31554
H  -7.066682 2.317329 -2.747916
H  6.110246 3.093237 1.009019
H  6.134581 2.103828 2.489042
H  7.621949 2.871058 1.903036
H  7.198667 2.32373 -2.101911
H  6.352009 1.033361 -2.98837
H  5.631693 2.652221 -2.864545
elementType: S P O C H
totalener: -2950.73583747 hartree
nucrepener: 3243.93711267 hartree
electener: -6194.67295014 hartree
twoeener: 4324.67272159 hartree
cpcmener: -0.03309253 hartree
kineticenergy: 2942.57239776 hartree
xcener: -192.750059781362 hartree
chargesum: 0.0000000
charge: -0.056153 -0.441908 -0.429981 0.755662 0.726800 -0.330971 -0.350294 -0.340344 -0.338283 -0.334288 -0.330723 0.038844 0.028545 0.232359 0.257365 -0.152453 -0.138595 -0.123830 -0.134714 -0.155197 -0.187804 -0.178770 -0.192860 -0.116757 -0.118040 -0.112940 -0.113248 0.136605 0.152847 0.147474 0.135091 0.148025 0.150791 0.150282 0.146462 0.113538 0.129437 0.124979 0.112491 0.127980 0.129331 0.119603 0.119752 0.127040 0.125489 0.115084 0.126279
qa: -0.0562 -0.4419 -0.4300 0.7557 0.7268 -0.3310 -0.3503 -0.3403 -0.3383 -0.3343 -0.3307 0.0388 0.0285 0.2324 0.2574 -0.1525 -0.1386 -0.1238 -0.1347 -0.1552 -0.1878 -0.1788 -0.1929 -0.1168 -0.1180 -0.1129 -0.1132 0.1366 0.1528 0.1475 0.1351 0.1480 0.1508 0.1503 0.1465 0.1135 0.1294 0.1250 0.1125 0.1280 0.1293 0.1196 0.1198 0.1270 0.1255 0.1151 0.1263
va: 2.3167 1.9889 2.0317 5.4840 5.5264 2.1273 2.0887 2.1008 2.0966 2.1038 2.0647 3.7159 3.7701 3.7578 3.7002 4.0201 3.9051 3.9353 3.9648 3.9687 4.0506 4.0015 4.0512 3.8440 3.8414 3.8485 3.8408 1.0151 0.9890 0.9951 1.0127 1.0096 1.0067 0.9998 1.0065 0.9994 0.9916 0.9854 0.9995 0.9888 0.9908 0.9924 0.9906 0.9895 0.9853 1.0019 0.9911
dispcorr: -0.023322800 hartree
energy: -2950.759160273826
dipole: -4.21824 3.11336 -1.10487 14.63735 -11.37459 3.26276 0.66309 -0.23292 0.43017
magnitude: 3.47151 au
magnitude: 8.82388 debye
