program: Orca
programVersion: 5.0.2
elementType: S S S P P O O O O O O C C C C C C C C C C C C C C C C H H H H H H H H H H H H H H H H H H H H
charge: 0
multiplicity: 1
keywords: wb97x-d3
keywords: def2-TZVPP
keywords: def2/J RIJCOSX
keywords: DEFGRID2
keywords: scfconv7
keywords: smallprint printgap noloewdin
keywords: NOSOSCF
formula: C16H20O6P2S3
InChI: InChI=1/C16H20O6P2S3/c1-17-23(25,18-2)21-13-5-9-15(10-6-13)27-16-11-7-14(8-12-16)22-24(26,19-3)20-4/h5-12H,1-4H3
47 atoms
S  0.007053 -3.639917 -0.625259
S  -4.890312 1.42443 -1.86925
S  6.646223 1.769252 1.036712
P  -5.040609 1.258136 0.033467
P  5.055924 1.031827 0.270245
O  -4.589123 -0.151334 0.678099
O  4.840491 -0.50442 0.720373
O  -6.493956 1.408987 0.663029
O  -4.187659 2.256649 0.933372
O  3.648288 1.656409 0.669356
O  4.96139 1.048688 -1.323453
C  -1.322828 -2.537196 -0.237068
C  1.432072 -2.675509 -0.210222
C  -3.491902 -0.898003 0.331387
C  3.702118 -1.214859 0.3912
C  -2.512864 -3.083887 0.232762
C  1.568669 -2.081137 1.042633
C  -1.234865 -1.162571 -0.427824
C  2.45199 -2.552774 -1.145034
C  -3.601403 -2.269243 0.498863
C  2.694029 -1.333114 1.337572
C  -2.306045 -0.338232 -0.124123
C  3.598682 -1.830593 -0.843034
C  -7.655012 0.888719 0.005972
C  -4.194543 3.665134 0.668598
C  3.385373 3.053107 0.488405
C  6.106357 0.773884 -2.135769
H  -2.600946 -4.15015 0.399058
H  0.790685 -2.18387 1.788182
H  -0.324497 -0.713254 -0.802122
H  2.355199 -3.009777 -2.121324
H  -4.526085 -2.70029 0.860751
H  2.796339 -0.860174 2.305915
H  -2.190567 0.729864 -0.2500
H  4.395059 -1.752744 -1.57164
H  -7.763007 1.310262 -0.993214
H  -8.509432 1.179655 0.611834
H  -7.617621 -0.198897 -0.059993
H  -3.479749 4.113525 1.353606
H  -3.888721 3.874733 -0.35683
H  -5.180864 4.093291 0.848761
H  4.176462 3.663817 0.925256
H  3.279684 3.295615 -0.568838
H  2.449986 3.263437 1.000309
H  6.512552 -0.217742 -1.934216
H  5.771209 0.817394 -3.169122
H  6.883133 1.521663 -1.97674
elementType: S P O C H
totalener: -2950.73529945 hartree
nucrepener: 3316.52514610 hartree
electener: -6267.26044555 hartree
twoeener: 4396.69913857 hartree
cpcmener: -0.03264976 hartree
kineticenergy: 2942.55931856 hartree
xcener: -192.750551800097 hartree
chargesum: -0.0000000
charge: -0.040678 -0.443776 -0.430687 0.752708 0.718156 -0.317140 -0.345556 -0.340385 -0.336255 -0.320856 -0.332917 0.032448 0.044843 0.245569 0.251635 -0.138115 -0.148438 -0.173999 -0.147342 -0.188972 -0.180928 -0.153103 -0.173639 -0.118068 -0.116334 -0.109970 -0.117121 0.134245 0.153281 0.153958 0.135327 0.147175 0.150039 0.130132 0.158114 0.112311 0.129192 0.126372 0.129433 0.109937 0.128707 0.106191 0.124131 0.125672 0.123098 0.131633 0.119975
qa: -0.0407 -0.4438 -0.4307 0.7527 0.7182 -0.3171 -0.3456 -0.3404 -0.3363 -0.3209 -0.3329 0.0324 0.0448 0.2456 0.2516 -0.1381 -0.1484 -0.1740 -0.1473 -0.1890 -0.1809 -0.1531 -0.1736 -0.1181 -0.1163 -0.1100 -0.1171 0.1342 0.1533 0.1540 0.1353 0.1472 0.1500 0.1301 0.1581 0.1123 0.1292 0.1264 0.1294 0.1099 0.1287 0.1062 0.1241 0.1257 0.1231 0.1316 0.1200
va: 2.3626 1.9900 2.0274 5.4971 5.5238 2.1542 2.1142 2.1079 2.0924 2.1044 2.0600 3.7865 3.7317 3.7596 3.7380 3.9702 3.9231 3.9745 4.0089 4.0116 3.9999 3.9350 4.0316 3.8434 3.8378 3.8448 3.8289 1.0109 0.9910 0.9913 1.0155 1.0032 1.0015 1.0250 0.9880 1.0002 0.9908 0.9854 0.9898 1.0014 0.9896 1.0014 0.9901 0.9892 0.9850 0.9899 1.0051
dispcorr: -0.023446982 hartree
energy: -2950.758746435054
dipole: -6.51658 5.00553 -1.51105 9.49305 -8.47541 1.01764 -3.48882 2.97410 -0.51473
magnitude: 1.89309 au
magnitude: 4.81186 debye
