program: Orca
programVersion: 5.0.2
elementType: S S S P P O O O O O O C C C C C C C C C C C C C C C C H H H H H H H H H H H H H H H H H H H H
charge: 0
multiplicity: 1
keywords: wb97x-d3
keywords: def2-TZVPP
keywords: def2/J RIJCOSX
keywords: DEFGRID2
keywords: scfconv7
keywords: smallprint printgap noloewdin
keywords: NOSOSCF
formula: C16H20O6P2S3
InChI: InChI=1/C16H20O6P2S3/c1-17-23(25,18-2)21-13-5-9-15(10-6-13)27-16-11-7-14(8-12-16)22-24(26,19-3)20-4/h5-12H,1-4H3
47 atoms
S  -0.032464 -3.249986 -0.531169
S  -4.038153 2.222237 0.757489
S  6.158357 2.80518 -1.101103
P  -5.422205 0.898868 0.760342
P  5.549602 1.086023 -0.522683
O  -4.998286 -0.578925 1.263424
O  3.967676 1.095967 -0.213362
O  -6.101249 0.548181 -0.635264
O  -6.690619 1.167507 1.682664
O  5.803639 -0.15135 -1.495869
O  6.124354 0.527571 0.853383
C  -1.498038 -2.408492 0.004947
C  1.169055 -1.950866 -0.441012
C  -3.831982 -1.176524 0.832545
C  3.094217 0.036869 -0.302909
C  -1.510869 -1.64709 1.171378
C  0.941778 -0.714918 -1.041175
C  -2.666322 -2.560218 -0.731829
C  2.373352 -2.184992 0.209712
C  -2.673593 -1.016651 1.578453
C  1.898502 0.279994 -0.965987
C  -3.841229 -1.949095 -0.315748
C  3.345661 -1.195796 0.276315
C  -6.493555 1.585987 -1.540337
C  -6.546634 1.729299 2.991614
C  5.658855 -0.02995 -2.915111
C  7.536182 0.511723 1.096463
H  -0.610917 -1.532745 1.761856
H  0.013985 -0.520005 -1.563627
H  -2.665787 -3.14526 -1.642508
H  2.559443 -3.138407 0.687249
H  -2.683347 -0.419193 2.480555
H  1.71896 1.245689 -1.421197
H  -4.750881 -2.073235 -0.888764
H  4.265722 -1.392162 0.810065
H  -7.24683 2.236209 -1.094469
H  -6.919812 1.093695 -2.410661
H  -5.634719 2.182275 -1.848741
H  -7.54837 1.811115 3.405967
H  -5.946394 1.086262 3.63637
H  -6.094321 2.720017 2.945204
H  6.335791 0.725705 -3.313953
H  5.914587 -0.999029 -3.336438
H  4.633946 0.21974 -3.191754
H  8.040301 -0.19611 0.437989
H  7.968868 1.503752 0.962548
H  7.671837 0.19958 2.128633
elementType: S P O C H
totalener: -2950.73487663 hartree
nucrepener: 3282.53401878 hartree
electener: -6233.26889541 hartree
twoeener: 4363.19407305 hartree
cpcmener: -0.03099395 hartree
kineticenergy: 2942.56254409 hartree
xcener: -192.748285318471 hartree
chargesum: -0.0000000
charge: -0.055741 -0.447083 -0.433474 0.765698 0.714903 -0.352959 -0.325611 -0.337662 -0.336247 -0.324139 -0.327003 0.025184 0.027999 0.256205 0.209954 -0.116988 -0.118449 -0.143989 -0.157548 -0.197600 -0.184144 -0.173777 -0.151157 -0.119300 -0.115180 -0.108985 -0.111999 0.150117 0.149816 0.134989 0.136253 0.147113 0.149085 0.152241 0.152156 0.125718 0.127596 0.113313 0.129329 0.125582 0.112522 0.115141 0.130094 0.125429 0.124792 0.109744 0.128063
qa: -0.0557 -0.4471 -0.4335 0.7657 0.7149 -0.3530 -0.3256 -0.3377 -0.3362 -0.3241 -0.3270 0.0252 0.0280 0.2562 0.2100 -0.1170 -0.1184 -0.1440 -0.1575 -0.1976 -0.1841 -0.1738 -0.1512 -0.1193 -0.1152 -0.1090 -0.1120 0.1501 0.1498 0.1350 0.1363 0.1471 0.1491 0.1522 0.1522 0.1257 0.1276 0.1133 0.1293 0.1256 0.1125 0.1151 0.1301 0.1254 0.1248 0.1097 0.1281
va: 2.3173 1.9915 2.0326 5.4973 5.5188 2.1041 2.1296 2.1170 2.1018 2.0594 2.0948 3.7392 3.7389 3.7084 3.7811 3.9052 3.9109 3.9826 4.0218 4.0181 3.9890 4.0572 3.9538 3.8500 3.8422 3.8345 3.8373 0.9912 0.9918 1.0142 1.0151 1.0051 1.0041 1.0050 1.0144 0.9865 0.9904 0.9987 0.9913 0.9852 0.9998 1.0044 0.9911 0.9820 0.9883 1.0031 0.9899
dispcorr: -0.023529273 hartree
energy: -2950.758405899311
dipole: -1.22948 0.56973 -0.65975 -0.61993 -0.48010 -1.10003 -1.53167 1.37463 -0.15704
magnitude: 1.29228 au
magnitude: 3.28472 debye
