program: Orca
programVersion: 5.0.2
elementType: S S S P P O O O O O O C C C C C C C C C C C C C C C C H H H H H H H H H H H H H H H H H H H H
charge: 0
multiplicity: 1
keywords: wb97x-d3
keywords: def2-TZVPP
keywords: def2/J RIJCOSX
keywords: DEFGRID2
keywords: scfconv7
keywords: smallprint printgap noloewdin
keywords: NOSOSCF
formula: C16H20O6P2S3
InChI: InChI=1/C16H20O6P2S3/c1-17-23(25,18-2)21-13-5-9-15(10-6-13)27-16-11-7-14(8-12-16)22-24(26,19-3)20-4/h5-12H,1-4H3
47 atoms
S  -0.029069 -3.2302 -0.349633
S  -4.230298 2.55735 0.175386
S  5.135169 0.605924 -2.61366
P  -5.410288 1.185231 0.788005
P  5.641535 0.698312 -0.768102
O  -5.133445 -0.324654 0.28208
O  4.445073 0.580083 0.313872
O  -6.908373 1.397165 0.30559
O  -5.465669 0.933955 2.366633
O  6.638643 -0.413831 -0.218757
O  6.345869 2.036883 -0.272921
C  -1.499242 -2.262895 -0.163259
C  1.262466 -2.040074 -0.128032
C  -3.90203 -0.918281 0.15874
C  3.399088 -0.302666 0.146167
C  -2.480436 -2.338774 -1.144683
C  2.418193 -2.448964 0.52959
C  -1.730416 -1.502435 0.979233
C  1.183946 -0.749686 -0.64494
C  -3.684115 -1.669773 -0.983571
C  3.49632 -1.585401 0.656159
C  -2.922994 -0.818112 1.139692
C  2.248394 0.12337 -0.499345
C  -7.954287 0.448617 0.563594
C  -5.493819 2.039523 3.27568
C  7.732513 -0.888835 -1.011273
C  5.85562 3.319988 -0.674393
H  -2.31053 -2.916706 -2.043854
H  2.48563 -3.443732 0.951659
H  -0.980919 -1.441209 1.757845
H  0.295599 -0.417631 -1.166497
H  -4.448927 -1.731258 -1.747158
H  4.39254 -1.906197 1.171444
H  -3.086009 -0.247816 2.044219
H  2.184835 1.129216 -0.893459
H  -8.893675 0.976119 0.417665
H  -7.920384 0.067109 1.584124
H  -7.898436 -0.382025 -0.139088
H  -4.57354 2.619838 3.210753
H  -6.347115 2.692024 3.086825
H  -5.58383 1.618042 4.273675
H  8.435461 -0.087054 -1.238558
H  8.237202 -1.646469 -0.417297
H  7.378659 -1.336753 -1.939592
H  4.843291 3.490294 -0.305964
H  6.522061 4.058435 -0.235839
H  5.869206 3.423905 -1.759516
elementType: S P O C H
totalener: -2950.73587257 hartree
nucrepener: 3269.47703573 hartree
electener: -6220.21290830 hartree
twoeener: 4350.56996701 hartree
cpcmener: -0.03270947 hartree
kineticenergy: 2942.55319237 hartree
xcener: -192.747974058800 hartree
chargesum: 0.0000000
charge: -0.044964 -0.423320 -0.447338 0.717360 0.765230 -0.324028 -0.355181 -0.336504 -0.334880 -0.339745 -0.335824 0.020194 0.039944 0.252547 0.236274 -0.122784 -0.154116 -0.144749 -0.138535 -0.197241 -0.167991 -0.168057 -0.185471 -0.113451 -0.113434 -0.118903 -0.115055 0.136875 0.134112 0.152614 0.153700 0.148912 0.152323 0.148871 0.148703 0.127177 0.120415 0.119131 0.115079 0.129000 0.129372 0.126139 0.127937 0.114053 0.125864 0.129472 0.110273
qa: -0.0450 -0.4233 -0.4473 0.7174 0.7652 -0.3240 -0.3552 -0.3365 -0.3349 -0.3397 -0.3358 0.0202 0.0399 0.2525 0.2363 -0.1228 -0.1541 -0.1447 -0.1385 -0.1972 -0.1680 -0.1681 -0.1855 -0.1135 -0.1134 -0.1189 -0.1151 0.1369 0.1341 0.1526 0.1537 0.1489 0.1523 0.1489 0.1487 0.1272 0.1204 0.1191 0.1151 0.1290 0.1294 0.1261 0.1279 0.1141 0.1259 0.1295 0.1103
va: 2.3523 2.0233 1.9892 5.5178 5.4958 2.1134 2.0986 2.1097 2.0503 2.1130 2.1035 3.7501 3.7659 3.7371 3.7243 3.9729 3.9800 3.9878 3.9123 4.0294 4.0602 3.9665 4.0118 3.8491 3.8273 3.8484 3.8438 1.0128 1.0131 0.9937 0.9892 1.0020 1.0041 1.0111 1.0029 0.9894 0.9925 0.9905 1.0019 0.9885 0.9916 0.9860 0.9909 0.9985 0.9858 0.9906 1.0004
dispcorr: -0.023273760 hartree
energy: -2950.759146334647
dipole: -1.82623 0.96019 -0.86603 3.02633 -3.15312 -0.12679 6.71655 -4.91500 1.80155
magnitude: 2.00291 au
magnitude: 5.09100 debye
