program: Orca
programVersion: 5.0.2
elementType: S S S P P O O O O O O C C C C C C C C C C C C C C C C H H H H H H H H H H H H H H H H H H H H
charge: 0
multiplicity: 1
keywords: wb97x-d3
keywords: def2-TZVPP
keywords: def2/J RIJCOSX
keywords: DEFGRID2
keywords: scfconv7
keywords: smallprint printgap noloewdin
keywords: NOSOSCF
formula: C16H20O6P2S3
InChI: InChI=1/C16H20O6P2S3/c1-17-23(25,18-2)21-13-5-9-15(10-6-13)27-16-11-7-14(8-12-16)22-24(26,19-3)20-4/h5-12H,1-4H3
47 atoms
S  -0.004756 -2.535926 -0.919207
S  -6.855761 -0.825746 -0.075559
S  6.89061 -0.942768 -0.76041
P  -6.045086 0.835272 0.423012
P  6.067696 0.631567 -0.038781
O  -4.529031 0.76559 0.980132
O  4.787571 0.40332 0.923853
O  -6.736913 1.653469 1.59896
O  -5.884497 1.952023 -0.700124
O  6.882429 1.50269 1.009832
O  5.579123 1.712236 -1.105343
C  -1.347171 -1.524189 -0.35855
C  1.402066 -1.620932 -0.348988
C  -3.513113 -0.012851 0.488337
C  3.676847 -0.275957 0.470675
C  -1.530863 -1.262198 0.99702
C  1.49204 -0.240505 -0.505301
C  -2.260599 -1.029751 -1.279622
C  2.460745 -2.319925 0.22043
C  -2.606401 -0.503299 1.419977
C  2.625875 0.435973 -0.088042
C  -3.349802 -0.276123 -0.862598
C  3.607461 -1.650257 0.621004
C  -7.252584 0.99464 2.76076
C  -6.948334 2.226322 -1.619603
C  8.258864 1.821098 0.782558
C  5.388825 1.426718 -2.492939
H  -0.834488 -1.650532 1.729158
H  0.678109 0.316854 -0.950698
H  -2.125274 -1.217951 -2.336716
H  2.396305 -3.391182 0.362532
H  -2.74767 -0.29638 2.473151
H  2.689076 1.511229 -0.196383
H  -4.03259 0.114597 -1.604921
H  4.426622 -2.194501 1.071894
H  -7.660529 1.772544 3.40085
H  -6.465358 0.466676 3.299494
H  -8.043855 0.29446 2.494135
H  -7.19838 1.341383 -2.204458
H  -7.837868 2.583212 -1.100253
H  -6.587611 3.005882 -2.285509
H  8.581202 2.418748 1.631297
H  8.86685 0.918014 0.728769
H  8.387966 2.401807 -0.13129
H  5.24433 2.384346 -2.986242
H  6.260439 0.932196 -2.919625
H  4.508951 0.804275 -2.650086
elementType: S P O C H
totalener: -2950.73480690 hartree
nucrepener: 3238.90082444 hartree
electener: -6189.63563134 hartree
twoeener: 4319.49094599 hartree
cpcmener: -0.03097615 hartree
kineticenergy: 2942.56851246 hartree
xcener: -192.751698934807 hartree
chargesum: -0.0000000
charge: -0.060440 -0.440253 -0.448704 0.749286 0.754268 -0.318342 -0.346699 -0.339198 -0.337952 -0.332711 -0.340876 0.026909 0.025973 0.255502 0.251813 -0.109415 -0.116515 -0.156801 -0.141745 -0.193224 -0.210581 -0.158916 -0.181460 -0.117382 -0.117208 -0.123328 -0.097936 0.147406 0.151957 0.134631 0.135408 0.148489 0.154284 0.137591 0.145805 0.129587 0.125172 0.113022 0.112377 0.129561 0.129770 0.129800 0.114079 0.124353 0.130034 0.112742 0.119871
qa: -0.0604 -0.4403 -0.4487 0.7493 0.7543 -0.3183 -0.3467 -0.3392 -0.3380 -0.3327 -0.3409 0.0269 0.0260 0.2555 0.2518 -0.1094 -0.1165 -0.1568 -0.1417 -0.1932 -0.2106 -0.1589 -0.1815 -0.1174 -0.1172 -0.1233 -0.0979 0.1474 0.1520 0.1346 0.1354 0.1485 0.1543 0.1376 0.1458 0.1296 0.1252 0.1130 0.1124 0.1296 0.1298 0.1298 0.1141 0.1244 0.1300 0.1127 0.1199
va: 2.3066 1.9928 1.9872 5.4973 5.5044 2.1468 2.1129 2.1083 2.0895 2.1172 2.0718 3.7300 3.7727 3.7557 3.7203 3.9279 3.8835 4.0290 3.9750 3.9928 4.0022 3.9589 4.0378 3.8447 3.8377 3.8498 3.8209 0.9946 0.9890 1.0165 1.0136 1.0026 1.0020 1.0163 1.0069 0.9909 0.9857 0.9989 0.9997 0.9890 0.9905 0.9910 0.9988 0.9855 0.9919 1.0066 0.9847
dispcorr: -0.023304234 hartree
energy: -2950.758111135568
dipole: -1.52971 1.01745 -0.51226 10.59786 -8.29231 2.30555 -2.26436 2.09064 -0.17372
magnitude: 2.36815 au
magnitude: 6.01936 debye
