program: Orca
programVersion: 5.0.2
elementType: S S S P P O O O O O O C C C C C C C C C C C C C C C C H H H H H H H H H H H H H H H H H H H H
charge: 0
multiplicity: 1
keywords: wb97x-d3
keywords: def2-TZVPP
keywords: def2/J RIJCOSX
keywords: DEFGRID2
keywords: scfconv7
keywords: smallprint printgap noloewdin
keywords: NOSOSCF
formula: C16H20O6P2S3
InChI: InChI=1/C16H20O6P2S3/c1-17-23(25,18-2)21-13-5-9-15(10-6-13)27-16-11-7-14(8-12-16)22-24(26,19-3)20-4/h5-12H,1-4H3
47 atoms
S  -0.145007 -2.781205 -0.631977
S  -5.293334 1.829471 -1.239875
S  6.486692 -0.86506 -1.434962
P  -5.957339 1.023185 0.365727
P  6.065072 0.401428 -0.062312
O  -4.884038 0.213584 1.26269
O  4.505158 0.785517 0.117528
O  -7.09577 -0.082919 0.228502
O  -6.582337 1.991266 1.464172
O  6.437684 0.019877 1.436641
O  6.70216 1.854032 -0.191775
C  -1.52324 -1.810452 -0.086397
C  1.229143 -1.693261 -0.385135
C  -3.787705 -0.453885 0.768886
C  3.452529 -0.07834 -0.051376
C  -1.434132 -0.87992 0.944746
C  1.317925 -0.47856 -1.061131
C  -2.757406 -2.054908 -0.680963
C  2.263207 -2.090797 0.452569
C  -2.56113 -0.189171 1.358301
C  2.425149 0.332178 -0.889926
C  -3.893748 -1.389398 -0.247799
C  3.383637 -1.289145 0.618025
C  -8.265686 0.164112 -0.559857
C  -5.994022 3.26581 1.744121
C  7.723929 -0.51897 1.759662
C  6.764258 2.516985 -1.458681
H  -0.487449 -0.681261 1.429943
H  0.522968 -0.162113 -1.723998
H  -2.844215 -2.768041 -1.49117
H  2.198485 -3.027412 0.99071
H  -2.488154 0.54252 2.153068
H  2.49714 1.27928 -1.409461
H  -4.848781 -1.609487 -0.707152
H  4.173929 -1.603175 1.287403
H  -8.827192 1.018437 -0.180475
H  -8.882877 -0.727618 -0.48527
H  -8.005801 0.335082 -1.604642
H  -6.565035 3.697084 2.562583
H  -4.952261 3.167193 2.051404
H  -6.055393 3.922983 0.876865
H  7.721361 -0.705589 2.830545
H  7.900868 -1.456551 1.232529
H  8.52016 0.187314 1.522782
H  7.390157 1.964744 -2.15946
H  5.770522 2.650905 -1.887795
H  7.205812 3.493498 -1.276477
elementType: S P O C H
totalener: -2950.73664167 hartree
nucrepener: 3234.71633138 hartree
electener: -6185.45297305 hartree
twoeener: 4315.62490860 hartree
cpcmener: -0.03165970 hartree
kineticenergy: 2942.55097096 hartree
xcener: -192.748409161885 hartree
chargesum: 0.0000000
charge: -0.046277 -0.444161 -0.441542 0.755020 0.752872 -0.333007 -0.329501 -0.337374 -0.340674 -0.337272 -0.338975 0.046739 0.032850 0.219382 0.227318 -0.153504 -0.133459 -0.160816 -0.139752 -0.183140 -0.171591 -0.153822 -0.158641 -0.118521 -0.116972 -0.117517 -0.116352 0.152434 0.151313 0.134286 0.136461 0.148999 0.150982 0.144567 0.149680 0.126539 0.129663 0.111630 0.129241 0.123654 0.114179 0.129439 0.111559 0.128050 0.112217 0.124558 0.129241
qa: -0.0463 -0.4442 -0.4415 0.7550 0.7529 -0.3330 -0.3295 -0.3374 -0.3407 -0.3373 -0.3390 0.0467 0.0328 0.2194 0.2273 -0.1535 -0.1335 -0.1608 -0.1398 -0.1831 -0.1716 -0.1538 -0.1586 -0.1185 -0.1170 -0.1175 -0.1164 0.1524 0.1513 0.1343 0.1365 0.1490 0.1510 0.1446 0.1497 0.1265 0.1297 0.1116 0.1292 0.1237 0.1142 0.1294 0.1116 0.1280 0.1122 0.1246 0.1292
va: 2.3487 1.9877 1.9915 5.4858 5.4913 2.1234 2.1269 2.0978 2.1002 2.0998 2.1035 3.7852 3.7361 3.7543 3.7645 3.9186 3.9468 3.9857 4.0168 4.0138 3.9936 3.9711 3.9788 3.8439 3.8474 3.8412 3.8468 0.9900 0.9939 1.0133 1.0152 1.0009 0.9991 1.0120 1.0098 0.9891 0.9901 0.9992 0.9915 0.9854 0.9989 0.9906 0.9998 0.9887 0.9996 0.9852 0.9913
dispcorr: -0.022930719 hartree
energy: -2950.759572389637
dipole: -0.27662 0.22140 -0.05522 8.06645 -6.63900 1.42744 3.53481 -2.37176 1.16305
magnitude: 1.84210 au
magnitude: 4.68224 debye
