program: Orca
programVersion: 5.0.2
elementType: S S S P P O O O O O O C C C C C C C C C C C C C C C C H H H H H H H H H H H H H H H H H H H H
charge: 0
multiplicity: 1
keywords: wb97x-d3
keywords: def2-TZVPP
keywords: def2/J RIJCOSX
keywords: DEFGRID2
keywords: scfconv7
keywords: smallprint printgap noloewdin
keywords: NOSOSCF
formula: C16H20O6P2S3
InChI: InChI=1/C16H20O6P2S3/c1-17-23(25,18-2)21-13-5-9-15(10-6-13)27-16-11-7-14(8-12-16)22-24(26,19-3)20-4/h5-12H,1-4H3
47 atoms
S  0.108962 -3.776001 0.102788
S  -3.943259 1.417271 -1.259003
S  3.214756 2.509837 -0.070482
P  -4.821357 1.105859 0.414878
P  4.688292 1.368154 -0.49652
O  -4.629238 -0.36892 1.051857
O  4.380394 0.040574 -1.367212
O  -6.407741 1.240635 0.443591
O  -4.403152 2.005964 1.658915
O  5.775975 2.084131 -1.40423
O  5.460302 0.7071 0.738627
C  -1.281855 -2.716276 0.38302
C  1.363583 -2.603626 -0.330656
C  -3.504146 -1.131038 0.83119
C  3.380799 -0.838213 -1.007592
C  -2.514064 -3.074855 -0.149914
C  2.623139 -2.73008 0.242347
C  -1.174207 -1.564403 1.158256
C  1.127201 -1.597602 -1.264873
C  -3.63096 -2.284296 0.078354
C  3.641001 -1.852055 -0.102286
C  -2.280926 -0.762308 1.37241
C  2.12983 -0.702198 -1.590904
C  -7.207353 0.750517 -0.637294
C  -4.291161 3.427877 1.535444
C  6.945416 1.413379 -1.896311
C  5.799724 1.493079 1.886193
H  -2.607666 -3.962311 -0.762572
H  2.816611 -3.504406 0.973519
H  -0.224177 -1.280089 1.592066
H  0.156421 -1.498747 -1.733193
H  -4.589271 -2.55783 -0.344234
H  4.62185 -1.95879 0.341621
H  -2.190107 0.134163 1.972518
H  1.945572 0.086371 -2.308629
H  -7.092436 -0.327269 -0.759393
H  -6.952169 1.250438 -1.571926
H  -8.24106 0.971266 -0.383609
H  -5.254077 3.880352 1.297005
H  -3.95332 3.796672 2.500581
H  -3.561889 3.699242 0.771898
H  7.417223 0.797645 -1.130418
H  6.69853 0.797076 -2.759965
H  7.643025 2.189837 -2.200687
H  4.903805 1.845117 2.397438
H  6.362163 0.843896 2.552622
H  6.4217 2.347504 1.615203
elementType: S P O C H
totalener: -2950.73624570 hartree
nucrepener: 3348.14071370 hartree
electener: -6298.87695940 hartree
twoeener: 4429.62790757 hartree
cpcmener: -0.03304849 hartree
kineticenergy: 2942.56650260 hartree
xcener: -192.748571089495 hartree
chargesum: 0.0000000
charge: -0.045987 -0.445396 -0.428812 0.761266 0.729274 -0.346115 -0.350697 -0.339582 -0.336646 -0.334334 -0.331959 0.035785 0.022653 0.223403 0.260195 -0.139762 -0.137923 -0.141083 -0.115418 -0.177125 -0.179281 -0.161191 -0.204855 -0.116595 -0.116862 -0.112739 -0.114650 0.135079 0.135119 0.152409 0.150299 0.150860 0.152038 0.153665 0.148472 0.124264 0.112187 0.128967 0.126007 0.128544 0.111701 0.119889 0.120074 0.126974 0.115900 0.126244 0.125747
qa: -0.0460 -0.4454 -0.4288 0.7613 0.7293 -0.3461 -0.3507 -0.3396 -0.3366 -0.3343 -0.3320 0.0358 0.0227 0.2234 0.2602 -0.1398 -0.1379 -0.1411 -0.1154 -0.1771 -0.1793 -0.1612 -0.2049 -0.1166 -0.1169 -0.1127 -0.1147 0.1351 0.1351 0.1524 0.1503 0.1509 0.1520 0.1537 0.1485 0.1243 0.1122 0.1290 0.1260 0.1285 0.1117 0.1199 0.1201 0.1270 0.1159 0.1262 0.1257
va: 2.3429 1.9869 2.0318 5.4839 5.5244 2.1095 2.0890 2.1019 2.1077 2.1060 2.0635 3.7298 3.7474 3.7260 3.7026 3.9756 3.9795 3.9381 3.8958 4.0387 4.0565 3.9873 4.0327 3.8484 3.8444 3.8469 3.8421 1.0133 1.0137 0.9916 0.9921 0.9960 1.0061 1.0064 1.0051 0.9845 1.0001 0.9915 0.9881 0.9903 0.9993 0.9923 0.9909 0.9893 1.0016 0.9916 0.9854
dispcorr: -0.023929799 hartree
energy: -2950.760175504065
dipole: 4.31242 -3.27133 1.04109 4.84359 -4.92691 -0.08332 2.63055 -2.00953 0.62102
magnitude: 1.21511 au
magnitude: 3.08855 debye
