program: Orca
programVersion: 5.0.2
elementType: S S S P P O O O O O O C C C C C C C C C C C C C C C C H H H H H H H H H H H H H H H H H H H H
charge: 0
multiplicity: 1
keywords: wb97x-d3
keywords: def2-TZVPP
keywords: def2/J RIJCOSX
keywords: DEFGRID2
keywords: scfconv7
keywords: smallprint printgap noloewdin
keywords: NOSOSCF
formula: C16H20O6P2S3
InChI: InChI=1/C16H20O6P2S3/c1-17-23(25,18-2)21-13-5-9-15(10-6-13)27-16-11-7-14(8-12-16)22-24(26,19-3)20-4/h5-12H,1-4H3
47 atoms
S  -0.139191 -3.747234 0.196021
S  -3.269241 2.261352 0.80464
S  6.761833 1.413678 -1.340494
P  -4.905682 1.283125 0.618019
P  5.080982 1.041191 -0.504388
O  -4.805455 -0.133099 -0.157848
O  4.787315 -0.542338 -0.462989
O  -6.094191 1.975089 -0.184995
O  -5.641852 0.834062 1.955329
O  4.912517 1.422507 1.031941
O  3.788785 1.718299 -1.147883
C  -1.491374 -2.607769 0.100629
C  1.269769 -2.698615 -0.028797
C  -3.695923 -0.944772 -0.052521
C  3.585037 -1.191988 -0.306916
C  -1.625227 -1.722179 -0.966058
C  1.409871 -1.491729 0.648287
C  -2.474533 -2.658354 1.081664
C  2.300441 -3.143149 -0.849192
C  -2.718529 -0.876737 -1.034639
C  2.557913 -0.728863 0.50534
C  -3.586289 -1.831133 1.00384
C  3.458445 -2.394868 -0.98403
C  -5.850563 2.629164 -1.435174
C  -5.76316 1.73187 3.064255
C  5.179744 2.75172 1.494662
C  3.604264 1.76916 -2.566562
H  -0.872818 -1.682965 -1.743373
H  0.623556 -1.134219 1.300705
H  -2.376134 -3.337858 1.918394
H  2.205937 -4.07435 -1.393003
H  -2.821182 -0.181901 -1.858231
H  2.640943 0.196065 1.058539
H  -4.35406 -1.878099 1.765423
H  4.261768 -2.74516 -1.619501
H  -5.153703 3.45879 -1.314913
H  -6.808404 3.012313 -1.777639
H  -5.460483 1.932465 -2.178368
H  -6.292757 1.190096 3.843621
H  -4.782726 2.029884 3.435372
H  -6.335865 2.619671 2.794444
H  4.434394 3.454117 1.121161
H  5.129009 2.720531 2.579864
H  6.174289 3.081352 1.19216
H  4.394832 2.35019 -3.041326
H  3.577465 0.769609 -3.002138
H  2.647424 2.255958 -2.737138
elementType: S P O C H
totalener: -2950.73513695 hartree
nucrepener: 3322.69900260 hartree
electener: -6273.43413955 hartree
twoeener: 4402.96746629 hartree
cpcmener: -0.03140652 hartree
kineticenergy: 2942.54483298 hartree
xcener: -192.746108233171 hartree
chargesum: 0.0000000
charge: -0.048247 -0.447245 -0.429256 0.764388 0.704488 -0.354271 -0.315494 -0.336011 -0.338986 -0.327408 -0.324102 0.031245 0.022437 0.244078 0.219944 -0.129318 -0.159551 -0.143434 -0.132248 -0.185724 -0.149049 -0.167127 -0.184856 -0.115423 -0.117894 -0.109690 -0.111042 0.152227 0.150662 0.136206 0.134929 0.150419 0.147722 0.152844 0.147510 0.110837 0.130067 0.124757 0.128110 0.112672 0.126007 0.124616 0.128439 0.109814 0.116258 0.125623 0.130079
qa: -0.0482 -0.4472 -0.4293 0.7644 0.7045 -0.3543 -0.3155 -0.3360 -0.3390 -0.3274 -0.3241 0.0312 0.0224 0.2441 0.2199 -0.1293 -0.1596 -0.1434 -0.1322 -0.1857 -0.1490 -0.1671 -0.1849 -0.1154 -0.1179 -0.1097 -0.1110 0.1522 0.1507 0.1362 0.1349 0.1504 0.1477 0.1528 0.1475 0.1108 0.1301 0.1248 0.1281 0.1127 0.1260 0.1246 0.1284 0.1098 0.1163 0.1256 0.1301
va: 2.3406 1.9878 2.0373 5.4934 5.5290 2.0999 2.1443 2.1043 2.1133 2.0920 2.0564 3.7384 3.7623 3.7124 3.7816 3.9216 3.9853 3.9897 3.9679 4.0081 3.9138 4.0534 4.0064 3.8469 3.8475 3.8342 3.8357 0.9915 0.9941 1.0141 1.0129 0.9985 1.0182 1.0047 1.0050 0.9998 0.9907 0.9857 0.9909 0.9989 0.9864 0.9896 0.9895 1.0039 1.0037 0.9831 0.9911
dispcorr: -0.023576416 hartree
energy: -2950.758713367123
dipole: -9.21835 6.79380 -2.42455 10.91113 -9.61982 1.29131 0.04251 -0.08901 -0.04651
magnitude: 2.74738 au
magnitude: 6.98328 debye
