program: Orca
programVersion: 5.0.2
elementType: S S S P P O O O O O O C C C C C C C C C C C C C C C C H H H H H H H H H H H H H H H H H H H H
charge: 0
multiplicity: 1
keywords: wb97x-d3
keywords: def2-TZVPP
keywords: def2/J RIJCOSX
keywords: DEFGRID2
keywords: scfconv7
keywords: smallprint printgap noloewdin
keywords: NOSOSCF
formula: C16H20O6P2S3
InChI: InChI=1/C16H20O6P2S3/c1-17-23(25,18-2)21-13-5-9-15(10-6-13)27-16-11-7-14(8-12-16)22-24(26,19-3)20-4/h5-12H,1-4H3
47 atoms
S  -0.023578 -3.781743 0.204986
S  -3.293416 2.135449 -0.620984
S  4.979658 0.73564 1.971913
P  -4.771288 1.179758 0.134689
P  4.914584 1.211574 0.122363
O  -4.853613 -0.40334 -0.198468
O  4.340069 0.067094 -0.878083
O  -6.230959 1.636437 -0.298932
O  -4.889105 1.147295 1.720762
O  4.047444 2.511183 -0.162865
O  6.279666 1.547282 -0.624321
C  -1.485773 -2.793709 0.068166
C  1.242634 -2.578443 -0.096648
C  -3.735047 -1.202995 -0.106617
C  3.309638 -0.787275 -0.570093
C  -1.825246 -2.197643 -1.143921
C  1.075292 -1.224382 0.175515
C  -2.300653 -2.618004 1.178664
C  2.461459 -3.027711 -0.596778
C  -2.942987 -1.38741 -1.230586
C  2.099664 -0.326279 -0.074388
C  -3.435853 -1.824118 1.093292
C  3.499643 -2.136777 -0.818412
C  -6.522677 2.005564 -1.650657
C  -4.606993 2.307747 2.511541
C  3.816937 3.015171 -1.487077
C  7.416454 0.685758 -0.500517
H  -1.204043 -2.345709 -2.017797
H  0.142675 -0.848672 0.574572
H  -2.044982 -3.082996 2.12173
H  2.610054 -4.076226 -0.82365
H  -3.201762 -0.908565 -2.165676
H  1.935802 0.726728 0.115975
H  -4.070759 -1.685673 1.958537
H  4.446397 -2.490958 -1.206111
H  -7.586157 2.22762 -1.687211
H  -6.30498 1.191758 -2.342996
H  -5.959743 2.891545 -1.943868
H  -4.729936 2.010225 3.549793
H  -3.584395 2.650227 2.354369
H  -5.301306 3.117669 2.286934
H  4.724855 3.45344 -1.900209
H  3.44727 2.238927 -2.156976
H  3.059129 3.788838 -1.394041
H  7.199066 -0.31708 -0.870096
H  8.206218 1.123212 -1.10582
H  7.748841 0.626358 0.536098
elementType: S P O C H
totalener: -2950.73619233 hartree
nucrepener: 3348.18115967 hartree
electener: -6298.91735200 hartree
twoeener: 4429.06025743 hartree
cpcmener: -0.03242646 hartree
kineticenergy: 2942.56687769 hartree
xcener: -192.750491464000 hartree
chargesum: 0.0000000
charge: -0.049632 -0.447123 -0.423663 0.767610 0.724850 -0.352919 -0.337358 -0.335881 -0.338578 -0.340691 -0.335477 0.047964 0.053453 0.257419 0.227024 -0.140821 -0.161389 -0.133295 -0.147022 -0.178291 -0.156904 -0.175899 -0.186838 -0.114754 -0.118696 -0.118695 -0.114483 0.149217 0.143877 0.137531 0.132742 0.148492 0.142303 0.152139 0.147893 0.129366 0.125351 0.112868 0.127823 0.113733 0.127334 0.126825 0.121048 0.127779 0.123758 0.128829 0.111181
qa: -0.0496 -0.4471 -0.4237 0.7676 0.7248 -0.3529 -0.3374 -0.3359 -0.3386 -0.3407 -0.3355 0.0480 0.0535 0.2574 0.2270 -0.1408 -0.1614 -0.1333 -0.1470 -0.1783 -0.1569 -0.1759 -0.1868 -0.1148 -0.1187 -0.1187 -0.1145 0.1492 0.1439 0.1375 0.1327 0.1485 0.1423 0.1521 0.1479 0.1294 0.1254 0.1129 0.1278 0.1137 0.1273 0.1268 0.1210 0.1278 0.1238 0.1288 0.1112
va: 2.3450 1.9902 2.0248 5.4930 5.5055 2.1033 2.0652 2.1037 2.1154 2.0936 2.0905 3.7219 3.7828 3.7187 3.7389 3.9439 3.9293 3.9925 3.9647 3.9936 3.9561 4.0518 4.0391 3.8430 3.8475 3.8372 3.8481 0.9969 1.0001 1.0129 1.0099 1.0040 1.0123 1.0055 0.9998 0.9915 0.9854 0.9991 0.9908 0.9991 0.9859 0.9938 0.9917 0.9893 0.9865 0.9900 0.9988
dispcorr: -0.024052894 hartree
energy: -2950.760245225040
dipole: -1.11282 0.32197 -0.79085 8.00096 -7.23520 0.76576 -6.22307 4.48547 -1.73759
magnitude: 2.05696 au
magnitude: 5.22837 debye
