program: Orca
programVersion: 5.0.2
elementType: S S S P P O O O O O O C C C C C C C C C C C C C C C C H H H H H H H H H H H H H H H H H H H H
charge: 0
multiplicity: 1
keywords: wb97x-d3
keywords: def2-TZVPP
keywords: def2/J RIJCOSX
keywords: DEFGRID2
keywords: scfconv7
keywords: smallprint printgap noloewdin
keywords: NOSOSCF
formula: C16H20O6P2S3
InChI: InChI=1/C16H20O6P2S3/c1-17-23(25,18-2)21-13-5-9-15(10-6-13)27-16-11-7-14(8-12-16)22-24(26,19-3)20-4/h5-12H,1-4H3
47 atoms
S  -0.020859 -3.500483 -0.908808
S  -5.240346 1.081379 -1.425079
S  3.340922 2.17614 0.213422
P  -5.033957 1.214975 0.474127
P  4.957399 1.214885 -0.126855
O  -4.323189 -0.036569 1.212852
O  4.884304 -0.384613 0.17036
O  -6.36134 1.344873 1.34296
O  -4.155023 2.412516 1.047217
O  5.451992 1.358343 -1.627003
O  6.265155 1.583453 0.701432
C  -1.273732 -2.415466 -0.281438
C  1.447645 -2.567242 -0.579218
C  -3.310451 -0.793011 0.672695
C  3.744515 -1.108311 -0.094155
C  -1.192541 -1.033152 -0.418475
C  1.764833 -2.175728 0.719382
C  -2.389004 -2.97764 0.329997
C  2.300927 -2.243467 -1.626244
C  -2.198835 -0.218775 0.07191
C  2.903792 -1.430052 0.961464
C  -3.416005 -2.168577 0.791083
C  3.459814 -1.517982 -1.385432
C  -7.537235 0.603269 1.000946
C  -4.281514 3.741998 0.529959
C  6.673288 0.777063 -2.107309
C  6.245288 1.642738 2.131419
H  -0.337047 -0.574797 -0.897213
H  1.111391 -2.433773 1.542781
H  -2.463381 -4.050383 0.456149
H  2.059769 -2.540598 -2.638696
H  -2.098574 0.855122 -0.015365
H  3.144293 -1.106813 1.966061
H  -4.285342 -2.608071 1.263241
H  4.123115 -1.267754 -2.203904
H  -8.272861 0.816598 1.772564
H  -7.342642 -0.469728 0.981958
H  -7.929006 0.917794 0.033626
H  -5.278969 4.143818 0.710607
H  -3.551804 4.349482 1.059552
H  -4.064832 3.769925 -0.537943
H  7.516854 1.427414 -1.879227
H  6.854477 -0.213371 -1.689903
H  6.571653 0.688225 -3.186122
H  6.116073 0.650046 2.563605
H  7.206215 2.045205 2.441407
H  5.450895 2.300017 2.486803
elementType: S P O C H
totalener: -2950.73629807 hartree
nucrepener: 3324.59169464 hartree
electener: -6275.32799271 hartree
twoeener: 4405.80591225 hartree
cpcmener: -0.03379898 hartree
kineticenergy: 2942.55648092 hartree
xcener: -192.748206260371 hartree
chargesum: 0.0000000
charge: -0.052845 -0.442779 -0.426480 0.755487 0.729229 -0.329523 -0.355546 -0.340062 -0.338706 -0.340623 -0.330148 0.039279 0.047048 0.222441 0.248203 -0.156173 -0.132415 -0.145591 -0.143522 -0.154824 -0.178853 -0.178086 -0.163142 -0.117760 -0.118676 -0.126839 -0.110055 0.147475 0.148800 0.133916 0.135549 0.143203 0.146935 0.147305 0.157798 0.129241 0.124062 0.113465 0.129223 0.129738 0.112639 0.129409 0.122111 0.129347 0.124741 0.129299 0.106706
qa: -0.0528 -0.4428 -0.4265 0.7555 0.7292 -0.3295 -0.3555 -0.3401 -0.3387 -0.3406 -0.3301 0.0393 0.0470 0.2224 0.2482 -0.1562 -0.1324 -0.1456 -0.1435 -0.1548 -0.1789 -0.1781 -0.1631 -0.1178 -0.1187 -0.1268 -0.1101 0.1475 0.1488 0.1339 0.1355 0.1432 0.1469 0.1473 0.1578 0.1292 0.1241 0.1135 0.1292 0.1297 0.1126 0.1294 0.1221 0.1293 0.1247 0.1293 0.1067
va: 2.3310 1.9883 2.0225 5.4855 5.5123 2.1284 2.0514 2.1025 2.0934 2.1065 2.0939 3.7632 3.7024 3.7589 3.7097 3.9451 3.9352 3.9734 4.0074 3.9480 4.0235 4.0177 4.0294 3.8471 3.8391 3.8400 3.8414 0.9959 0.9945 1.0120 1.0153 1.0131 0.9996 1.0012 0.9912 0.9916 0.9857 0.9987 0.9886 0.9904 0.9998 0.9936 0.9916 0.9888 0.9888 0.9894 1.0015
dispcorr: -0.024033994 hartree
energy: -2950.760332066236
dipole: 4.24951 -2.83765 1.41187 3.92543 -4.06897 -0.14353 3.71774 -2.68093 1.03681
magnitude: 1.75754 au
magnitude: 4.46732 debye
