program: Orca
programVersion: 5.0.2
elementType: S S S P P O O O O O O C C C C C C C C C C C C C C C C H H H H H H H H H H H H H H H H H H H H
charge: 0
multiplicity: 1
keywords: wb97x-d3
keywords: def2-TZVPP
keywords: def2/J RIJCOSX
keywords: DEFGRID2
keywords: scfconv7
keywords: smallprint printgap noloewdin
keywords: NOSOSCF
formula: C16H20O6P2S3
InChI: InChI=1/C16H20O6P2S3/c1-17-23(25,18-2)21-13-5-9-15(10-6-13)27-16-11-7-14(8-12-16)22-24(26,19-3)20-4/h5-12H,1-4H3
47 atoms
S  -0.02193 -3.664486 0.333559
S  -3.430463 2.307052 -0.157827
S  5.218823 0.889831 1.895469
P  -4.941325 1.184915 0.198383
P  5.064874 1.217293 0.019556
O  -4.856992 -0.331619 -0.36022
O  4.468363 -0.006162 -0.866639
O  -6.345011 1.632618 -0.402642
O  -5.309993 0.92088 1.723019
O  4.170533 2.482917 -0.32421
O  6.392091 1.506464 -0.810092
C  -1.456067 -2.650207 0.111917
C  1.289411 -2.520461 0.001113
C  -3.72297 -1.09727 -0.191752
C  3.413907 -0.811814 -0.520571
C  -1.672167 -1.954688 -1.075499
C  1.210531 -1.175195 0.34678
C  -2.395848 -2.581012 1.13222
C  2.450181 -3.004913 -0.593268
C  -2.79603 -1.161492 -1.222133
C  2.260493 -0.315545 0.070449
C  -3.540281 -1.810781 0.979753
C  3.518836 -2.156643 -0.837456
C  -6.449702 2.150484 -1.733631
C  -5.191569 1.955551 2.706255
C  3.8610 2.876685 -1.669659
C  7.535901 0.653313 -0.687856
H  -0.954792 -2.014896 -1.883913
H  0.322882 -0.777208 0.820571
H  -2.234855 -3.116648 2.058781
H  2.527935 -4.046887 -0.877556
H  -2.959724 -0.60886 -2.138052
H  2.157939 0.733541 0.3153
H  -4.273694 -1.765323 1.773992
H  4.420898 -2.537167 -1.29959
H  -7.491918 2.423424 -1.87902
H  -6.170951 1.398695 -2.473585
H  -5.824664 3.034858 -1.861727
H  -5.481499 1.512116 3.655976
H  -4.164597 2.3154 2.775563
H  -5.855901 2.791526 2.484079
H  3.464008 2.046092 -2.253358
H  3.099705 3.649378 -1.595992
H  4.739608 3.287087 -2.166782
H  7.312792 -0.360581 -1.023256
H  8.310013 1.075991 -1.323621
H  7.893474 0.624138 0.341918
elementType: S P O C H
totalener: -2950.73626596 hartree
nucrepener: 3327.98542514 hartree
electener: -6278.72169111 hartree
twoeener: 4408.74112632 hartree
cpcmener: -0.03230442 hartree
kineticenergy: 2942.55044625 hartree
xcener: -192.747861416586 hartree
chargesum: 0.0000000
charge: -0.044559 -0.448013 -0.422417 0.766885 0.722750 -0.351613 -0.329017 -0.336012 -0.339338 -0.338891 -0.335677 0.041562 0.036071 0.247609 0.239238 -0.140722 -0.163891 -0.139250 -0.139598 -0.182917 -0.148530 -0.171364 -0.193241 -0.114903 -0.117399 -0.117624 -0.112383 0.152527 0.150355 0.137037 0.134150 0.149261 0.137339 0.152706 0.148122 0.129333 0.126025 0.110746 0.127879 0.113630 0.127292 0.120640 0.127719 0.126529 0.123996 0.128611 0.109347
qa: -0.0446 -0.4480 -0.4224 0.7669 0.7227 -0.3516 -0.3290 -0.3360 -0.3393 -0.3389 -0.3357 0.0416 0.0361 0.2476 0.2392 -0.1407 -0.1639 -0.1393 -0.1396 -0.1829 -0.1485 -0.1714 -0.1932 -0.1149 -0.1174 -0.1176 -0.1124 0.1525 0.1504 0.1370 0.1342 0.1493 0.1373 0.1527 0.1481 0.1293 0.1260 0.1107 0.1279 0.1136 0.1273 0.1206 0.1277 0.1265 0.1240 0.1286 0.1093
va: 2.3529 1.9900 2.0273 5.4933 5.5092 2.1045 2.0763 2.1056 2.1124 2.0922 2.0937 3.7293 3.7734 3.7246 3.7454 3.9273 3.9440 3.9984 3.9724 4.0039 3.9343 4.0494 4.0315 3.8424 3.8457 3.8387 3.8464 0.9925 0.9939 1.0136 1.0109 1.0026 1.0183 1.0057 1.0007 0.9907 0.9857 1.0004 0.9910 0.9991 0.9861 0.9916 0.9890 0.9934 0.9873 0.9897 0.9995
dispcorr: -0.023836910 hartree
energy: -2950.760102872653
dipole: -1.83394 1.03979 -0.79415 6.84287 -6.33606 0.50681 -6.83994 4.91953 -1.92041
magnitude: 2.13904 au
magnitude: 5.43702 debye
