program: Orca
programVersion: 5.0.2
elementType: S S S P P O O O O O O C C C C C C C C C C C C C C C C H H H H H H H H H H H H H H H H H H H H
charge: 0
multiplicity: 1
keywords: wb97x-d3
keywords: def2-TZVPP
keywords: def2/J RIJCOSX
keywords: DEFGRID2
keywords: scfconv7
keywords: smallprint printgap noloewdin
keywords: NOSOSCF
formula: C16H20O6P2S3
InChI: InChI=1/C16H20O6P2S3/c1-17-23(25,18-2)21-13-5-9-15(10-6-13)27-16-11-7-14(8-12-16)22-24(26,19-3)20-4/h5-12H,1-4H3
47 atoms
S  -0.012449 -2.667557 -0.468362
S  -6.862321 -0.929627 0.022605
S  6.844528 -1.056672 -0.212018
P  -6.028088 0.794759 0.012764
P  6.065501 0.629571 0.257585
O  -4.57653 0.903714 0.715133
O  4.63948 0.987606 -0.41714
O  -6.78693 1.976025 0.762437
O  -5.710648 1.441955 -1.406124
O  5.735797 0.877902 1.793645
O  6.886261 1.939073 -0.123495
C  -1.366728 -1.577429 -0.125445
C  1.365054 -1.55299 -0.435799
C  -3.538163 0.05161 0.405407
C  3.57687 0.109243 -0.401578
C  -1.548478 -0.399193 -0.845035
C  1.546684 -0.652555 0.610757
C  -2.286903 -1.936475 0.852058
C  2.306344 -1.621181 -1.45647
C  -2.628526 0.42259 -0.574227
C  2.646729 0.187398 0.624834
C  -3.384498 -1.12791 1.112524
C  3.423139 -0.797659 -1.435583
C  -7.509621 1.752233 1.977069
C  -6.654935 1.370246 -2.48022
C  6.569623 0.355408 2.833706
C  7.555186 2.051068 -1.384346
H  -0.843723 -0.112765 -1.615039
H  0.827376 -0.596174 1.41769
H  -2.14908 -2.844503 1.424798
H  2.171267 -2.311096 -2.279561
H  -2.757979 1.347888 -1.120492
H  2.775412 0.900822 1.428471
H  -4.095095 -1.403104 1.880454
H  4.149962 -0.845351 -2.235661
H  -6.843264 1.440418 2.781898
H  -8.288569 1.002361 1.838987
H  -7.968844 2.701395 2.242016
H  -7.570007 1.910925 -2.237336
H  -6.181588 1.837661 -3.3399
H  -6.897365 0.335269 -2.721909
H  6.637795 -0.730574 2.77316
H  7.570225 0.786314 2.792771
H  6.099355 0.633991 3.773451
H  8.058746 3.014479 -1.383234
H  8.294248 1.25917 -1.508206
H  6.846642 2.019383 -2.212861
elementType: S P O C H
totalener: -2950.73648307 hartree
nucrepener: 3237.25350973 hartree
electener: -6187.98999280 hartree
twoeener: 4318.22934833 hartree
cpcmener: -0.02977722 hartree
kineticenergy: 2942.56340321 hartree
xcener: -192.748110408346 hartree
chargesum: -0.0000000
charge: -0.052021 -0.448337 -0.448351 0.765216 0.766497 -0.350935 -0.352697 -0.336904 -0.337401 -0.340037 -0.336264 0.024284 0.023212 0.259020 0.257206 -0.129932 -0.129435 -0.130461 -0.132512 -0.182727 -0.184356 -0.188882 -0.187033 -0.113812 -0.116595 -0.116892 -0.114098 0.150423 0.150396 0.135622 0.136175 0.151634 0.151712 0.145678 0.145737 0.126199 0.111718 0.128978 0.125931 0.126895 0.112726 0.114102 0.127050 0.127791 0.129137 0.110469 0.125877
qa: -0.0520 -0.4483 -0.4484 0.7652 0.7665 -0.3509 -0.3527 -0.3369 -0.3374 -0.3400 -0.3363 0.0243 0.0232 0.2590 0.2572 -0.1299 -0.1294 -0.1305 -0.1325 -0.1827 -0.1844 -0.1889 -0.1870 -0.1138 -0.1166 -0.1169 -0.1141 0.1504 0.1504 0.1356 0.1362 0.1516 0.1517 0.1457 0.1457 0.1262 0.1117 0.1290 0.1259 0.1269 0.1127 0.1141 0.1270 0.1278 0.1291 0.1105 0.1259
va: 2.3225 1.9923 1.9908 5.4976 5.4952 2.1097 2.1041 2.0996 2.1161 2.1123 2.1028 3.7432 3.7475 3.7123 3.7124 3.9223 3.9184 3.9748 3.9719 4.0440 4.0468 4.0418 4.0399 3.8388 3.8485 3.8455 3.8418 0.9916 0.9911 1.0137 1.0133 1.0057 1.0055 1.0074 1.0069 0.9855 1.0007 0.9910 0.9862 0.9906 0.9994 0.9992 0.9861 0.9911 0.9908 1.0003 0.9856
dispcorr: -0.022853953 hartree
energy: -2950.759337022049
dipole: -0.32548 0.24082 -0.08466 8.87360 -6.82883 2.04477 1.33645 -1.03590 0.30055
magnitude: 2.06847 au
magnitude: 5.25763 debye
