program: Orca
programVersion: 5.0.2
elementType: S S S P P O O O O O O C C C C C C C C C C C C C C C C H H H H H H H H H H H H H H H H H H H H
charge: 0
multiplicity: 1
keywords: wb97x-d3
keywords: def2-TZVPP
keywords: def2/J RIJCOSX
keywords: DEFGRID2
keywords: scfconv7
keywords: smallprint printgap noloewdin
keywords: NOSOSCF
formula: C16H20O6P2S3
InChI: InChI=1/C16H20O6P2S3/c1-17-23(25,18-2)21-13-5-9-15(10-6-13)27-16-11-7-14(8-12-16)22-24(26,19-3)20-4/h5-12H,1-4H3
47 atoms
S  -0.044956 -3.377904 -0.007269
S  -6.312582 2.500927 1.602266
S  3.933838 2.104208 -1.607475
P  -5.450412 0.928491 0.935724
P  5.334831 1.047304 -0.839975
O  -3.945411 0.806379 1.501169
O  5.085054 -0.548784 -0.792438
O  -5.345652 0.774663 -0.649806
O  -6.04231 -0.492664 1.342602
O  6.761478 1.097077 -1.545566
O  5.723518 1.32636 0.67857
C  -1.196737 -2.104182 0.427742
C  1.447297 -2.451353 -0.241357
C  -3.067806 -0.186853 1.1128
C  3.856856 -1.136371 -0.601866
C  -2.026572 -2.298725 1.525636
C  2.174077 -2.632911 -1.411444
C  -1.31613 -0.943051 -0.331094
C  1.938143 -1.60461 0.749128
C  -2.975278 -1.344893 1.864353
C  3.38274 -1.97699 -1.593281
C  -2.244692 0.022451 0.016318
C  3.136257 -0.936038 0.567706
C  -5.09572 1.902933 -1.494037
C  -7.406165 -0.819045 1.050931
C  6.876152 1.077053 -2.972664
C  5.879358 2.668109 1.15608
H  -1.932276 -3.191254 2.130547
H  1.797279 -3.279092 -2.193657
H  -0.680692 -0.78277 -1.192577
H  1.388638 -1.463404 1.670991
H  -3.611667 -1.492041 2.727041
H  3.949347 -2.117585 -2.504777
H  -2.319911 0.935468 -0.560546
H  3.514787 -0.289656 1.349232
H  -4.195697 2.441221 -1.195655
H  -5.943555 2.587663 -1.486171
H  -4.958111 1.512055 -2.499167
H  -7.611149 -1.77016 1.5354
H  -8.085264 -0.063068 1.447579
H  -7.563947 -0.922091 -0.022778
H  7.937258 1.139279 -3.199967
H  6.475867 0.152419 -3.390212
H  6.362793 1.928462 -3.419829
H  4.964564 3.243614 1.013677
H  6.096513 2.595978 2.218615
H  6.7070 3.171774 0.655707
elementType: S P O C H
totalener: -2950.73655951 hartree
nucrepener: 3285.48629576 hartree
electener: -6236.22285527 hartree
twoeener: 4366.00896160 hartree
cpcmener: -0.03295675 hartree
kineticenergy: 2942.55996566 hartree
xcener: -192.746479577917 hartree
chargesum: -0.0000000
charge: -0.057583 -0.431211 -0.445849 0.715054 0.759425 -0.342039 -0.336368 -0.334090 -0.325896 -0.339277 -0.338242 0.036528 0.030020 0.248513 0.225836 -0.142869 -0.137227 -0.141584 -0.129470 -0.176760 -0.179069 -0.184340 -0.165240 -0.119798 -0.109316 -0.116373 -0.116799 0.135169 0.135266 0.149057 0.149151 0.149876 0.149794 0.161669 0.154478 0.123058 0.122997 0.134216 0.126165 0.106463 0.123195 0.129615 0.124809 0.110925 0.112056 0.129341 0.126725
qa: -0.0576 -0.4312 -0.4458 0.7151 0.7594 -0.3420 -0.3364 -0.3341 -0.3259 -0.3393 -0.3382 0.0365 0.0300 0.2485 0.2258 -0.1429 -0.1372 -0.1416 -0.1295 -0.1768 -0.1791 -0.1843 -0.1652 -0.1198 -0.1093 -0.1164 -0.1168 0.1352 0.1353 0.1491 0.1492 0.1499 0.1498 0.1617 0.1545 0.1231 0.1230 0.1342 0.1262 0.1065 0.1232 0.1296 0.1248 0.1109 0.1121 0.1293 0.1267
va: 2.3132 2.0238 1.9877 5.5304 5.4858 2.1209 2.1187 2.0545 2.1035 2.1042 2.1029 3.7485 3.7309 3.7421 3.7385 3.9753 3.9729 3.9445 3.9547 4.0385 4.0314 4.0104 3.9847 3.8247 3.8448 3.8464 3.8410 1.0137 1.0140 0.9943 0.9938 1.0030 0.9981 0.9877 1.0073 0.9857 1.0041 0.9900 0.9896 1.0010 0.9899 0.9909 0.9850 1.0002 0.9998 0.9904 0.9885
dispcorr: -0.023580243 hartree
energy: -2950.760139756145
dipole: 2.45892 -1.36756 1.09136 2.34780 -2.79822 -0.45042 -6.64059 5.31695 -1.32365
magnitude: 1.77369 au
magnitude: 4.50837 debye
