program: Orca
programVersion: 5.0.2
elementType: S S S P P O O O O O O C C C C C C C C C C C C C C C C H H H H H H H H H H H H H H H H H H H H
charge: 0
multiplicity: 1
keywords: wb97x-d3
keywords: def2-TZVPP
keywords: def2/J RIJCOSX
keywords: DEFGRID2
keywords: scfconv7
keywords: smallprint printgap noloewdin
keywords: NOSOSCF
formula: C16H20O6P2S3
InChI: InChI=1/C16H20O6P2S3/c1-17-23(25,18-2)21-13-5-9-15(10-6-13)27-16-11-7-14(8-12-16)22-24(26,19-3)20-4/h5-12H,1-4H3
47 atoms
S  0.098183 -2.491071 1.258779
S  -5.428408 2.135147 1.539431
S  6.865336 -0.679647 0.192252
P  -5.981895 0.75851 0.325781
P  5.958605 0.551937 -0.963065
O  -4.845684 0.146546 -0.646091
O  4.495124 1.051657 -0.491516
O  -7.089516 1.146067 -0.748397
O  -6.572497 -0.576228 0.955449
O  6.657843 1.95695 -1.221674
O  5.643603 0.064086 -2.443219
C  -1.350143 -1.650438 0.681624
C  1.405453 -1.429092 0.711359
C  -3.696358 -0.441013 -0.158393
C  3.499683 0.184793 -0.098014
C  -2.454511 -2.425061 0.338114
C  1.543664 -1.085797 -0.631596
C  -1.436072 -0.263062 0.611297
C  2.33458 -0.97377 1.638979
C  -3.63526 -1.821303 -0.06634
C  2.583281 -0.267604 -1.03743
C  -2.603868 0.34306 0.177727
C  3.394157 -0.174135 1.234181
C  -7.102109 2.425235 -1.389944
C  -7.465022 -0.544996 2.073303
C  7.229662 2.712415 -0.149691
C  6.594368 -0.691097 -3.20041
H  -2.400366 -3.505925 0.376587
H  0.834351 -1.447447 -1.364883
H  -0.593143 0.35685 0.88683
H  2.2324 -1.231665 2.685033
H  -4.48917 -2.426739 -0.341597
H  2.677415 0.019803 -2.076618
H  -2.659163 1.420667 0.101104
H  4.11153 0.189354 1.957871
H  -6.246773 2.538417 -2.057114
H  -7.101523 3.233873 -0.658365
H  -8.018842 2.471703 -1.972684
H  -7.672323 -1.580157 2.33289
H  -7.008353 -0.044731 2.927346
H  -8.400425 -0.04647 1.817052
H  6.46175 3.051083 0.546734
H  7.976511 2.129109 0.389851
H  7.708953 3.578353 -0.599411
H  7.481835 -0.097655 -3.422002
H  6.886412 -1.599207 -2.672901
H  6.103943 -0.960236 -4.132639
elementType: S P O C H
totalener: -2950.73617213 hartree
nucrepener: 3239.24759129 hartree
electener: -6189.98376341 hartree
twoeener: 4320.24703433 hartree
cpcmener: -0.02939884 hartree
kineticenergy: 2942.56320897 hartree
xcener: -192.749964176985 hartree
chargesum: -0.0000000
charge: -0.039196 -0.450383 -0.448204 0.763995 0.764573 -0.352033 -0.350929 -0.336013 -0.334721 -0.334669 -0.337131 0.035562 0.035678 0.258838 0.256362 -0.143852 -0.153723 -0.148834 -0.126119 -0.188103 -0.166432 -0.192187 -0.187862 -0.112614 -0.115440 -0.112381 -0.116091 0.135132 0.153445 0.154061 0.136699 0.149771 0.152534 0.145321 0.146639 0.126551 0.109689 0.128540 0.126988 0.112065 0.125608 0.126293 0.108422 0.128401 0.126161 0.112608 0.126979
qa: -0.0392 -0.4504 -0.4482 0.7640 0.7646 -0.3520 -0.3509 -0.3360 -0.3347 -0.3347 -0.3371 0.0356 0.0357 0.2588 0.2564 -0.1439 -0.1537 -0.1488 -0.1261 -0.1881 -0.1664 -0.1922 -0.1879 -0.1126 -0.1154 -0.1124 -0.1161 0.1351 0.1534 0.1541 0.1367 0.1498 0.1525 0.1453 0.1466 0.1266 0.1097 0.1285 0.1270 0.1121 0.1256 0.1263 0.1084 0.1284 0.1262 0.1126 0.1270
va: 2.3592 1.9916 1.9930 5.5011 5.5027 2.1101 2.1075 2.1020 2.1164 2.1050 2.1181 3.7859 3.7412 3.7098 3.7197 3.9579 3.9504 3.9193 3.9859 4.0655 4.0327 4.0295 4.0370 3.8377 3.8482 3.8411 3.8468 1.0111 0.9920 0.9897 1.0134 1.0045 1.0050 1.0117 1.0067 0.9856 1.0020 0.9905 0.9906 0.9997 0.9861 0.9862 1.0012 0.9904 0.9861 0.9999 0.9904
dispcorr: -0.022762347 hartree
energy: -2950.758934471891
dipole: -2.21775 1.71578 -0.50197 4.56035 -3.87188 0.68847 -4.75851 3.53763 -1.22088
magnitude: 1.48880 au
magnitude: 3.78422 debye
