program: Gaussian 09
title: 000066674
version: EM64L-G09RevD.01
frameworkgroup: C1[X(C14H12ClNO3)]
method: RPBEPBE
basis: SDD
operation: Freq
keyword: #p
keyword: freq=noraman
keyword: PBEPBE/SDD
title: #p freq=noraman PBEPBE/SDD
converged: YES YES NO NO
title: Mulliken charges:
elementType: Cl O O O N C C C C C C C C C C C C C C H H H H H H H H H H H H
charge: -0.054581 -0.264401 -0.437283 -0.322222 -0.511365 0.336248 0.431823 0.052848 -0.324131 -0.437058 -0.358547 -0.288086 0.324229 -0.328556 -0.353078 -0.096428 -0.273886 0.146212 -0.538018 0.369236 0.297357 0.245842 0.270982 0.278269 0.243073 0.254220 0.260800 0.246854 0.221309 0.221716 0.386621
chargesum: 0.00000
title: Mulliken charges with hydrogens summed into heavy atoms:
elementType: Cl O O O N C C C C C C C C C C C C C C
charge: -0.054581 -0.264401 -0.050662 -0.322222 -0.142129 0.336248 0.431823 0.052848 -0.026774 -0.191215 -0.087565 -0.009816 0.324229 -0.085483 -0.098858 -0.096428 -0.013086 0.146212 0.151861
polarizability: 3.10548902e+02 -4.19030526e+00 2.11202271e+02 7.30634862e+00 1.17286353e+01 9.17343158e+01
1716.lowfreq: -6.4558 -2.0145 -0.0021 -0.0016 -0.0016 3.4713 28.7610 38.4526 61.2352
frequency: 28.7549 38.4523 61.2341 81.3315 87.0650 106.1611 151.7044 160.6783 186.1907 218.4978 228.1703 244.7467 270.8069 299.8013 318.4722 347.9665 384.5474 415.6781 434.2207 441.7840 486.8895 509.1538 515.3307 556.3621 564.8203 581.7749 601.1071 634.0236 644.1432 670.4813 710.2218 733.6220 739.3549 760.0989 797.3624 806.4609 810.9833 825.6686 847.7285 872.4010 910.6223 933.2188 963.1076 967.1651 987.8723 999.6369 1006.9046 1078.3066 1113.1270 1114.7284 1119.7824 1156.9198 1166.2411 1177.1030 1214.3128 1230.2991 1255.9373 1299.5351 1304.2735 1330.2352 1365.0104 1394.0845 1424.1548 1432.4194 1436.8570 1457.2474 1467.2253 1473.1402 1497.6143 1511.0284 1572.1419 1576.6803 1609.9197 1626.8529 1635.9318 2959.0450 3046.5495 3126.5316 3136.4727 3149.5028 3165.1371 3170.7399 3172.1087 3186.7260 3191.8814 3263.2170 3535.6417
redmass: 4.6834 5.5282 5.0624 7.9395 4.4880 6.6175 6.0110 6.0786 5.0958 2.1907 4.1759 1.8876 4.9781 10.8401 6.5235 6.0661 5.3878 3.0147 4.1765 3.6153 7.0289 5.2497 2.7337 6.4245 1.3171 3.6060 4.7565 6.0823 6.7081 4.2155 3.8494 3.0293 5.0982 4.6797 1.2821 1.4607 1.6721 1.8247 2.6447 1.4482 6.1147 1.3740 1.3138 1.3386 8.3600 2.6118 5.4461 2.1774 1.2643 1.3253 1.6382 1.3279 1.6048 1.2023 2.3689 2.9614 1.7421 1.4554 1.6389 2.8324 6.0166 8.8332 4.1596 3.4924 1.1809 2.5745 1.0500 1.0784 2.7644 3.8179 6.8145 6.6304 3.5106 5.6331 3.3880 1.0331 1.1039 1.0991 1.0892 1.0883 1.0947 1.0884 1.0968 1.0920 1.0976 1.0797 1.0641
irintensity: 1.1767 0.3528 0.5625 0.1019 2.4013 1.8244 1.7970 3.2714 1.2767 0.0860 3.0616 0.6111 3.9601 2.6622 1.5580 7.4508 1.4101 0.7659 20.6933 17.4672 29.9918 32.0964 31.4078 8.7073 87.4017 19.3447 2.2906 13.8086 15.9484 42.9290 3.0407 5.4510 13.0325 19.2243 96.0936 17.1031 1.5916 41.1210 97.7587 10.0897 55.4668 1.3955 0.3805 0.9256 51.4620 18.6933 354.9301 68.0591 0.9987 11.6471 165.9202 0.3342 150.4411 50.4278 96.8316 164.7695 56.3881 0.9299 3.6611 159.8628 14.5306 1.7646 1.0030 147.7157 37.0822 120.3382 13.7571 81.2977 88.3570 395.1009 129.0925 32.9445 403.0527 36.3428 314.5548 82.9487 48.8212 28.3034 9.1388 10.1427 13.8612 0.3050 2.5809 0.0813 1.0881 183.0118 75.6664
temp: 298.150 k
press: 1.00000 atm
elementType: 17 8 8 8 7 6 6 6 6 6 6 6 6 6 6 6 6 6 6 1 1 1 1 1 1 1 1 1 1 1 1
symmnumber: 1
zpe: 604637.2 jmol-1
zpe.correction: 0.230294 hartree
zpe.thermalcorrener: 0.247325 hartree
zpe.thermalcorrenthalpy: 0.248269 hartree
zpe.thermalcorrgfe: 0.184155 hartree
zpe.sumelectzpe: -1279.833842 hartree
zpe.sumelectthermal: -1279.816812 hartree
zpe.sumelectthermalent: -1279.815868 hartree
zpe.sumelectthermalfe: -1279.879981 hartree
dipole: -1.7850 -2.1232 -0.8596
dipole: 2.9040
quadrupole: -91.4672 -118.1568 -118.5337
quadrupole: -1.7816 7.9814 3.4614
quadrupole: 17.9187 -8.7709 -9.1478 -1.7816 7.9814 3.4614
hfenergy: -1280.0641363 hartree
pointgroup: C01 [X(C14H12Cl1N1O3)]
dipole: -0.6686593 -0.8423692 -0.3855263 debye
polarizability: 310.6585185|-0.8819615|209.4576436|7.791453|18.1271799|93.3693271 unknown
InChI: InChI=1S/C14H12ClNO3/c1-19-11-5-3-10(4-6-11)16-13-8-9(15)2-7-12(13)14(17)18/h2-8,16-17H,1H3
charge 0 multiplicity 1
31 atoms
Cl 2.381055 3.939827 -0.101554
O  -5.228681 0.645676 0.339981
O  4.104103 -2.609627 0.05628
O  1.830484 -2.965167 -0.173022
N  0.224436 -0.830107 -0.130913
C  1.365612 -0.047354 -0.075574
C  -1.137642 -0.416826 -0.037338
C  2.672577 -0.676999 -0.02694
C  1.310085 1.383336 -0.101954
C  -2.099588 -1.080932 -0.837519
C  -1.582201 0.571073 0.88612
C  3.843381 0.130869 0.033002
C  -3.898141 0.236353 0.164191
C  -3.472797 -0.769085 -0.738818
C  -2.944603 0.899488 0.977697
C  2.493925 2.120511 -0.048261
C  3.779047 1.530354 0.033356
C  2.791281 -2.135708 -0.055395
C  -6.250433 -0.012614 -0.477353
H  0.41942 -1.843903 -0.232436
H  0.350236 1.892948 -0.201384
H  -1.768048 -1.844966 -1.549748
H  -0.867913 1.056904 1.557693
H  4.812572 -0.372716 0.076936
H  -4.187717 -1.303513 -1.371159
H  -3.295644 1.655692 1.686233
H  4.679117 2.146552 0.084065
H  -7.200044 0.458036 -0.183981
H  -6.293681 -1.099887 -0.270495
H  -6.069859 0.152899 -1.557491
H  4.079961 -3.603013 0.02108
