program: Orca
programVersion: 5.0.2
elementType: S S S P P O O O O O O C C C C C C C C C C C C C C C C H H H H H H H H H H H H H H H H H H H H
charge: 0
multiplicity: 1
keywords: wb97x-d3
keywords: def2-TZVPP
keywords: def2/J RIJCOSX
keywords: DEFGRID2
keywords: scfconv7
keywords: smallprint printgap noloewdin
keywords: NOSOSCF
formula: C16H20O6P2S3
InChI: InChI=1/C16H20O6P2S3/c1-17-23(25,18-2)21-13-5-9-15(10-6-13)27-16-11-7-14(8-12-16)22-24(26,19-3)20-4/h5-12H,1-4H3
47 atoms
S  0.091896 -3.278037 -0.266142
S  -5.252791 1.087631 -1.48175
S  4.151881 2.683417 -0.124105
P  -5.538873 0.872634 0.399803
P  5.357315 1.221471 -0.385832
O  -4.269705 0.402469 1.283348
O  4.87268 0.023602 -1.359267
O  -6.620746 -0.197548 0.868318
O  -5.985705 2.163904 1.216881
O  6.709007 1.649798 -1.101253
O  5.752393 0.383453 0.917787
C  -1.182512 -2.127164 0.162597
C  1.488397 -2.236852 -0.573624
C  -3.279267 -0.455757 0.874525
C  3.745912 -0.721817 -1.082771
C  -0.943372 -0.994946 0.936834
C  2.721173 -2.625174 -0.061585
C  -2.481859 -2.419976 -0.235447
C  1.398058 -1.092497 -1.361875
C  -1.985607 -0.148797 1.271606
C  3.8572 -1.87422 -0.324431
C  -3.536681 -1.597922 0.133342
C  2.522832 -0.321763 -1.600497
C  -7.869685 -0.326501 0.178512
C  -5.406055 3.443938 0.942586
C  7.721887 0.701125 -1.471578
C  5.952952 1.032537 2.17763
H  0.057241 -0.755862 1.272573
H  2.802956 -3.510987 0.555203
H  -2.685884 -3.294636 -0.840153
H  0.449007 -0.789422 -1.784761
H  -1.796251 0.74139 1.857897
H  4.816458 -2.186725 0.066353
H  -4.541446 -1.862637 -0.167868
H  2.452324 0.571426 -2.207073
H  -8.439566 0.602631 0.208166
H  -8.428804 -1.10265 0.694676
H  -7.714928 -0.624562 -0.858436
H  -5.623231 3.761485 -0.077327
H  -5.858311 4.144388 1.639934
H  -4.326621 3.434103 1.097288
H  7.919316 -0.017971 -0.676609
H  7.439204 0.172227 -2.380973
H  8.626944 1.273187 -1.659566
H  6.278452 0.26294 2.873091
H  6.722561 1.802368 2.114267
H  5.025568 1.47631 2.53831
elementType: S P O C H
totalener: -2950.73542477 hartree
nucrepener: 3285.05602728 hartree
electener: -6235.79145205 hartree
twoeener: 4365.96049756 hartree
cpcmener: -0.03225810 hartree
kineticenergy: 2942.54947021 hartree
xcener: -192.748689964465 hartree
chargesum: 0.0000000
charge: -0.030903 -0.442826 -0.429576 0.754471 0.727357 -0.325003 -0.352492 -0.338433 -0.340024 -0.333608 -0.331553 0.038908 0.034541 0.233381 0.265269 -0.153361 -0.135018 -0.155265 -0.148670 -0.179171 -0.182379 -0.158767 -0.192895 -0.117130 -0.117593 -0.112905 -0.112037 0.154327 0.136062 0.135164 0.156046 0.149083 0.148521 0.136721 0.148084 0.128101 0.129339 0.112681 0.112181 0.129293 0.124686 0.119290 0.119650 0.127413 0.126652 0.126698 0.115687
qa: -0.0309 -0.4428 -0.4296 0.7545 0.7274 -0.3250 -0.3525 -0.3384 -0.3400 -0.3336 -0.3316 0.0389 0.0345 0.2334 0.2653 -0.1534 -0.1350 -0.1553 -0.1487 -0.1792 -0.1824 -0.1588 -0.1929 -0.1171 -0.1176 -0.1129 -0.1120 0.1543 0.1361 0.1352 0.1560 0.1491 0.1485 0.1367 0.1481 0.1281 0.1293 0.1127 0.1122 0.1293 0.1247 0.1193 0.1196 0.1274 0.1267 0.1267 0.1157
va: 2.3844 1.9875 2.0308 5.4882 5.5208 2.1373 2.0871 2.0888 2.1054 2.1068 2.0593 3.7739 3.7596 3.7629 3.7057 3.9319 3.9735 3.9970 3.9292 3.9892 4.0497 3.9646 4.0289 3.8409 3.8478 3.8492 3.8380 0.9885 1.0133 1.0138 0.9889 1.0024 1.0055 1.0153 1.0070 0.9889 0.9911 0.9988 0.9991 0.9910 0.9857 0.9924 0.9907 0.9897 0.9919 0.9865 1.0006
dispcorr: -0.023391265 hartree
energy: -2950.758816035497
dipole: 2.98528 -2.05476 0.93052 1.50383 -2.07216 -0.56833 5.03399 -3.88457 1.14943
magnitude: 1.58432 au
magnitude: 4.02702 debye
