program: Orca
programVersion: 5.0.2
elementType: S S S P P O O O O O O C C C C C C C C C C C C C C C C H H H H H H H H H H H H H H H H H H H H
charge: 0
multiplicity: 1
keywords: wb97x-d3
keywords: def2-TZVPP
keywords: def2/J RIJCOSX
keywords: DEFGRID2
keywords: scfconv7
keywords: smallprint printgap noloewdin
keywords: NOSOSCF
formula: C16H20O6P2S3
InChI: InChI=1/C16H20O6P2S3/c1-17-23(25,18-2)21-13-5-9-15(10-6-13)27-16-11-7-14(8-12-16)22-24(26,19-3)20-4/h5-12H,1-4H3
47 atoms
S  0.109316 -3.264122 0.554762
S  -5.293822 0.612903 2.705067
S  4.720587 1.884642 0.743763
P  -5.551052 0.896707 0.833555
P  5.509775 1.015778 -0.767911
O  -4.919174 -0.237575 -0.144886
O  4.567431 -0.019511 -1.578046
O  -4.967971 2.281544 0.320585
O  -7.03719 0.926057 0.265774
O  6.017948 1.940117 -1.959921
O  6.783557 0.095586 -0.515261
C  -1.350308 -2.290903 0.328622
C  1.401815 -2.23356 -0.074988
C  -3.727843 -0.886496 0.058425
C  3.53767 -0.749261 -1.036845
C  -1.385152 -0.919155 0.560972
C  1.278959 -1.521184 -1.265172
C  -2.520045 -2.95285 -0.03013
C  2.607901 -2.207192 0.615953
C  -2.565413 -0.211211 0.406486
C  2.336555 -0.760548 -1.732132
C  -3.712212 -2.255931 -0.147159
C  3.685388 -1.481075 0.129784
C  -5.068655 2.708023 -1.04673
C  -7.999178 -0.060015 0.656289
C  5.251865 3.070416 -2.39072
C  7.868498 0.553679 0.299438
H  -0.489647 -0.386319 0.853159
H  0.354853 -1.543116 -1.828161
H  -2.509226 -4.017777 -0.225297
H  2.717389 -2.7520 1.544996
H  -2.561855 0.860718 0.55666
H  2.235265 -0.190578 -2.646965
H  -4.621735 -2.775374 -0.420937
H  4.623055 -1.494824 0.669801
H  -4.382191 3.543032 -1.160848
H  -6.080121 3.043751 -1.272274
H  -4.781355 1.919056 -1.742063
H  -7.683519 -1.062256 0.364363
H  -8.170697 -0.032045 1.732423
H  -8.923438 0.185848 0.139648
H  4.235879 2.785815 -2.667144
H  5.215849 3.834803 -1.614839
H  5.757307 3.470296 -3.266202
H  8.60377 -0.246844 0.314106
H  8.326943 1.450998 -0.117185
H  7.53592 0.754147 1.318014
elementType: S P O C H
totalener: -2950.73575539 hartree
nucrepener: 3268.64327708 hartree
electener: -6219.37903247 hartree
twoeener: 4349.30700848 hartree
cpcmener: -0.03354773 hartree
kineticenergy: 2942.54452290 hartree
xcener: -192.749170462852 hartree
chargesum: -0.0000000
charge: -0.029354 -0.421332 -0.442182 0.721379 0.755836 -0.332686 -0.331235 -0.339534 -0.332728 -0.339557 -0.337809 0.042212 0.048903 0.234158 0.226361 -0.176956 -0.165292 -0.140870 -0.151346 -0.144993 -0.167767 -0.184914 -0.157582 -0.117531 -0.115430 -0.117382 -0.117297 0.157146 0.154347 0.134827 0.135506 0.140847 0.149325 0.149250 0.141270 0.127024 0.125052 0.121711 0.124000 0.111625 0.128619 0.122885 0.114069 0.129609 0.129081 0.126640 0.112093
qa: -0.0294 -0.4213 -0.4422 0.7214 0.7558 -0.3327 -0.3312 -0.3395 -0.3327 -0.3396 -0.3378 0.0422 0.0489 0.2342 0.2264 -0.1770 -0.1653 -0.1409 -0.1513 -0.1450 -0.1678 -0.1849 -0.1576 -0.1175 -0.1154 -0.1174 -0.1173 0.1571 0.1543 0.1348 0.1355 0.1408 0.1493 0.1492 0.1413 0.1270 0.1251 0.1217 0.1240 0.1116 0.1286 0.1229 0.1141 0.1296 0.1291 0.1266 0.1121
va: 2.3903 2.0266 1.9890 5.5062 5.4858 2.0719 2.1264 2.0925 2.0919 2.1026 2.0951 3.7701 3.7561 3.7495 3.7615 3.9579 3.9464 3.9809 4.0008 3.9276 3.9868 4.0326 3.9680 3.8399 3.8483 3.8499 3.8431 0.9899 0.9889 1.0121 1.0145 1.0151 1.0010 1.0000 1.0135 0.9893 0.9931 0.9927 0.9863 0.9986 0.9900 0.9854 0.9981 0.9916 0.9904 0.9889 0.9994
dispcorr: -0.023342035 hartree
energy: -2950.759097427725
dipole: 0.00465 0.03698 0.04162 6.17782 -5.59918 0.57864 -9.36587 6.71576 -2.65011
magnitude: 2.71286 au
magnitude: 6.89555 debye
