program: Orca
programVersion: 5.0.2
elementType: S S S P P O O O O O O C C C C C C C C C C C C C C C C H H H H H H H H H H H H H H H H H H H H
charge: 0
multiplicity: 1
keywords: wb97x-d3
keywords: def2-TZVPP
keywords: def2/J RIJCOSX
keywords: DEFGRID2
keywords: scfconv7
keywords: smallprint printgap noloewdin
keywords: NOSOSCF
formula: C16H20O6P2S3
InChI: InChI=1/C16H20O6P2S3/c1-17-23(25,18-2)21-13-5-9-15(10-6-13)27-16-11-7-14(8-12-16)22-24(26,19-3)20-4/h5-12H,1-4H3
47 atoms
S  0.025936 -2.962288 -0.04288
S  -5.660935 0.935788 -1.814359
S  5.32545 1.435664 1.681326
P  -5.9408 0.764669 0.072374
P  5.949563 0.850196 -0.030852
O  -4.625029 0.548524 0.985602
O  4.831176 0.31986 -1.074134
O  -6.839177 -0.448182 0.582254
O  -6.608808 1.998965 0.82345
O  6.697235 1.921043 -0.937952
O  6.969243 -0.371758 -0.069838
C  -1.322821 -1.843632 0.209552
C  1.422008 -1.905207 -0.297158
C  -3.560396 -0.266383 0.682385
C  3.722486 -0.424795 -0.759635
C  -2.587765 -2.280444 -0.169519
C  1.438727 -0.931453 -1.293014
C  -1.188188 -0.606526 0.832516
C  2.566054 -2.129662 0.457749
C  -3.710017 -1.505523 0.078752
C  2.578599 -0.178513 -1.509258
C  -2.301939 0.18752 1.050098
C  3.725169 -1.404271 0.220897
C  -8.093643 -0.740807 -0.041962
C  -6.350259 3.346487 0.41547
C  6.256191 3.281905 -0.995314
C  8.054933 -0.452746 0.8593
H  -2.712676 -3.236841 -0.66163
H  0.560851 -0.752584 -1.900469
H  -0.216914 -0.248721 1.148622
H  2.565832 -2.87922 1.238454
H  -4.682944 -1.88727 -0.200109
H  2.590172 0.584948 -2.276765
H  -2.193696 1.153605 1.52671
H  4.608769 -1.621604 0.805625
H  -8.777524 0.106152 0.021445
H  -8.520001 -1.581636 0.499419
H  -7.95591 -1.019139 -1.086867
H  -6.873476 3.987571 1.120431
H  -5.285348 3.578251 0.446569
H  -6.731982 3.529633 -0.588645
H  6.894108 3.781994 -1.719582
H  5.219425 3.35313 -1.325151
H  6.363254 3.767693 -0.025675
H  7.690309 -0.49706 1.885628
H  8.589916 -1.370791 0.630155
H  8.735435 0.392226 0.750809
elementType: S P O C H
totalener: -2950.73553545 hartree
nucrepener: 3235.47807995 hartree
electener: -6186.21361540 hartree
twoeener: 4316.37240304 hartree
cpcmener: -0.03084368 hartree
kineticenergy: 2942.53970798 hartree
xcener: -192.748733861908 hartree
chargesum: -0.0000000
charge: -0.036779 -0.442443 -0.440271 0.751090 0.752723 -0.321007 -0.320758 -0.338431 -0.341210 -0.339344 -0.338413 0.041639 0.030171 0.231022 0.250852 -0.164227 -0.145391 -0.148960 -0.148230 -0.158375 -0.177052 -0.189193 -0.162724 -0.117829 -0.116408 -0.117432 -0.116543 0.133311 0.155406 0.152625 0.136006 0.139492 0.148986 0.148290 0.133754 0.127752 0.129789 0.112598 0.129021 0.124434 0.114466 0.129555 0.124587 0.113521 0.112185 0.129308 0.128434
qa: -0.0368 -0.4424 -0.4403 0.7511 0.7527 -0.3210 -0.3208 -0.3384 -0.3412 -0.3393 -0.3384 0.0416 0.0302 0.2310 0.2509 -0.1642 -0.1454 -0.1490 -0.1482 -0.1584 -0.1771 -0.1892 -0.1627 -0.1178 -0.1164 -0.1174 -0.1165 0.1333 0.1554 0.1526 0.1360 0.1395 0.1490 0.1483 0.1338 0.1278 0.1298 0.1126 0.1290 0.1244 0.1145 0.1296 0.1246 0.1135 0.1122 0.1293 0.1284
va: 2.3767 1.9897 1.9909 5.4890 5.4910 2.1429 2.1456 2.0899 2.1009 2.1076 2.0889 3.7973 3.7583 3.7663 3.7580 3.9973 3.9530 3.9244 4.0215 3.9596 3.9768 3.9992 3.9602 3.8401 3.8424 3.8462 3.8397 1.0143 0.9904 0.9899 1.0159 1.0161 1.0027 1.0036 1.0190 0.9896 0.9905 0.9994 0.9921 0.9864 0.9985 0.9914 0.9859 0.9985 0.9994 0.9907 0.9892
dispcorr: -0.022662638 hartree
energy: -2950.758198086003
dipole: -0.29168 0.49162 0.19994 6.86434 -5.84842 1.01592 0.32467 -0.28180 0.04287
magnitude: 1.03630 au
magnitude: 2.63406 debye
